program: Gaussian 09
title: 000241184
version: EM64L-G09RevD.01
frameworkgroup: C1[X(C13H13ClN2S2)]
method: RPBEPBE
basis: SDD
operation: Freq
keyword: #p
keyword: freq=noraman
keyword: PBEPBE/SDD
title: #p freq=noraman PBEPBE/SDD
converged: YES YES NO NO
title: Mulliken charges:
elementType: Cl S S N N C C C C C C C C C C C C C H H H H H H H H H H H H H
charge: -0.057037 0.280455 0.214765 0.065183 0.041155 0.490225 -0.803860 0.471746 -0.364145 -0.363925 -0.372532 -0.405891 -0.208240 -0.208608 -0.415474 -0.785988 -0.099689 -0.815432 0.279086 0.279563 0.244138 0.244121 0.254485 0.256869 0.256848 0.227838 0.246380 0.246400 0.276522 0.277121 0.247922
chargesum: 0.00000
title: Mulliken charges with hydrogens summed into heavy atoms:
elementType: Cl S S N N C C C C C C C C C C C C C
charge: -0.057037 0.280455 0.214765 0.065183 0.041155 0.490225 -0.245211 0.471746 -0.120007 -0.119804 -0.372532 -0.405891 0.048629 0.048241 -0.160990 -0.065371 -0.099689 -0.013867
polarizability: 3.37924214e+02 1.71690986e+00 1.75295830e+02 3.08815895e-01 9.82036753e-02 1.26392467e+02
1716.lowfreq: -10.2636 -5.0114 -4.9329 -0.0017 -0.0004 0.0014 6.0567 16.8621 30.1700
frequency: 6.0124 16.8115 30.1647 46.0690 73.7592 77.1153 101.3128 109.0296 134.4400 142.4854 153.5362 170.9879 234.8876 236.0812 266.9609 310.8885 317.0886 351.9031 368.4664 392.3405 406.4199 412.5840 431.6252 457.6879 496.8732 608.9873 625.9865 628.7553 641.2230 649.5757 665.1998 688.9820 729.3964 763.4596 802.0968 812.3844 827.6686 841.8142 891.0120 924.9451 951.6590 965.0546 975.6515 986.7771 995.4619 1000.7181 1047.1332 1062.3179 1072.2318 1090.1588 1127.9316 1171.4744 1184.6919 1213.7840 1220.5422 1241.8054 1253.6037 1292.0586 1296.8488 1340.2525 1368.3286 1377.8187 1395.5769 1405.0233 1434.6783 1441.5231 1450.4262 1453.5008 1461.2362 1478.3372 1494.6503 1537.2000 1586.9965 1600.8486 2974.3627 3026.1075 3046.1938 3051.1356 3088.6262 3121.0231 3132.0665 3137.0326 3139.0876 3151.3683 3155.9895 3171.7719 3174.8799
redmass: 5.6235 4.0064 9.3722 3.9751 7.9811 3.9248 4.5925 1.0546 1.0998 8.6601 4.1276 8.4371 4.4038 3.6110 5.2964 4.3454 6.9187 2.6667 12.0851 10.8264 2.8665 7.2325 3.6592 4.6152 3.4153 8.2329 6.8478 6.1773 6.9530 5.7289 7.1426 7.7086 3.2845 7.7386 4.2539 8.3844 1.2487 1.8211 1.5206 1.3603 1.3634 1.3760 1.1794 1.2872 1.5322 4.2521 1.5137 5.1755 2.7675 1.2597 1.1094 6.9070 1.1270 2.4966 2.7242 1.8428 5.6924 3.0423 1.2676 1.1678 2.2363 7.4332 2.8514 1.2275 1.0537 1.0912 1.5714 1.1748 1.0432 2.4910 2.0625 4.9938 7.4244 6.2738 1.0373 1.0280 1.0578 1.0975 1.0988 1.1083 1.0927 1.0901 1.0900 1.1043 1.1057 1.0952 1.0964
irintensity: 0.0279 0.0007 0.0713 0.4871 0.0155 5.4497 1.2178 0.0038 0.5459 0.6419 2.2001 0.0476 0.0111 1.4369 4.6597 0.0640 1.9924 0.8435 6.2525 5.4795 0.0008 17.3215 2.7420 5.2387 25.4725 0.0105 0.0367 9.4687 1.9467 17.4784 4.6161 24.4919 15.0489 2.5621 14.0945 68.9912 0.0164 47.3068 1.1287 6.9671 0.1441 0.0156 6.6867 3.0763 14.5095 49.6337 8.4743 110.6584 42.6312 6.3918 4.7263 170.3093 0.1396 1.1617 2.6050 20.7467 5.0413 131.5485 0.1893 40.2877 418.4886 0.1258 5.6603 17.6756 14.9901 26.2602 36.7523 2.0747 16.9241 83.8117 129.2253 167.9903 1.1000 16.0665 26.0564 16.2350 10.7173 13.4783 18.7739 3.8039 29.7526 7.8811 10.2167 9.8610 11.0339 6.3328 0.4370
temp: 298.150 k
press: 1.00000 atm
elementType: 17 16 16 7 7 6 6 6 6 6 6 6 6 6 6 6 6 6 1 1 1 1 1 1 1 1 1 1 1 1 1
symmnumber: 1
zpe: 599287.0 jmol-1
zpe.correction: 0.228256 hartree
zpe.thermalcorrener: 0.247036 hartree
zpe.thermalcorrenthalpy: 0.247980 hartree
zpe.thermalcorrgfe: 0.176173 hartree
zpe.sumelectzpe: -1867.567224 hartree
zpe.sumelectthermal: -1867.548444 hartree
zpe.sumelectthermalent: -1867.547500 hartree
zpe.sumelectthermalfe: -1867.619308 hartree
dipole: -3.2521 2.9542 -0.0102
dipole: 4.3936
quadrupole: -127.2010 -131.1318 -121.3862
quadrupole: 2.5337 0.1407 0.0840
quadrupole: -0.6280 -4.5588 5.1868 2.5337 0.1407 0.0840
hfenergy: -1867.7954802 hartree
pointgroup: C01 [X(C13H13Cl1N2S2)]
dipole: 1.2429353 1.1679622 0.2809117 debye
polarizability: 337.8246783|2.4929994|173.0739646|3.9400109|10.2887306|128.7138675 unknown
InChI: InChI=1S/C13H13ClN2S2/c1-9-7-15-13(16-12(9)17-2)18-8-10-3-5-11(14)6-4-10/h3-7H,8H2,1-2H3
charge 0 multiplicity 1
31 atoms
Cl -6.922411 0.003918 0.021724
S  -0.047866 -1.400332 -0.218558
S  4.080621 2.127891 0.641139
N  2.137109 0.235078 0.18649
N  2.543931 -2.105755 -0.322595
C  -2.285103 0.247754 0.125085
C  -0.779238 0.331574 0.159514
C  4.437524 -0.585362 0.052524
C  -3.020539 -0.060783 1.298669
C  -2.995056 0.471155 -1.082966
C  3.476534 0.450115 0.261169
C  1.731094 -1.035487 -0.102618
C  -4.430518 -0.13817 1.277305
C  -4.404847 0.39827 -1.125613
C  3.884334 -1.854295 -0.239167
C  5.925965 -0.350952 0.135062
C  -5.100236 0.094899 0.060723
C  2.455329 3.055273 0.816041
H  -0.372055 1.014852 -0.601089
H  -0.389591 0.62456 1.146114
H  -2.48874 -0.245718 2.238948
H  -2.443217 0.701376 -2.001473
H  4.542426 -2.713379 -0.41542
H  -4.993965 -0.373642 2.18452
H  -4.948476 0.573152 -2.058316
H  6.483039 -1.283354 -0.058463
H  6.255888 0.405813 -0.601936
H  6.219686 0.023961 1.133985
H  1.867699 2.622362 1.637256
H  1.89008 2.993006 -0.123969
H  2.7365 4.096022 1.038814
