program: Gaussian 09
title: 000241163
version: EM64L-G09RevD.01
frameworkgroup: C1[X(C6H7ClN2S)]
method: RPBEPBE
basis: SDD
operation: Freq
keyword: #p
keyword: freq=noraman
keyword: PBEPBE/SDD
title: #p freq=noraman PBEPBE/SDD
converged: NO NO NO NO
title: Mulliken charges:
elementType: Cl S N N C C C C C C H H H H H H H
charge: -0.018465 0.288954 0.019673 0.117947 0.233162 -0.247946 -0.765222 -0.442164 -0.168715 -0.826394 0.262941 0.237287 0.262448 0.237229 0.282284 0.282234 0.244746
chargesum: 0.00000
title: Mulliken charges with hydrogens summed into heavy atoms:
elementType: Cl S N N C C C C C C
charge: -0.018465 0.288954 0.019673 0.117947 0.233162 0.014995 -0.028257 -0.442164 -0.168715 -0.017130
polarizability: 1.50559671e+02 -4.09953380e+00 1.25878066e+02 -1.04821286e-02 -1.43588527e-02 4.90667489e+01
1716.lowfreq: -5.6993 -2.6071 -0.0037 -0.0026 0.0021 7.2731 61.2802 74.1191 133.0313
frequency: 60.9096 74.0636 132.9869 136.5705 142.6722 162.9335 214.0997 230.7251 270.5915 364.2188 415.3669 470.4134 540.4360 559.9991 596.0297 667.4080 763.3023 776.0840 869.0925 884.3939 925.5520 984.1074 994.4702 999.1276 1048.2912 1106.8826 1239.0862 1247.2138 1285.5080 1338.9834 1358.7034 1392.4601 1438.4050 1449.3704 1453.3136 1464.8712 1495.7481 1533.4072 2986.2956 3015.8789 3065.0525 3127.7845 3136.6977 3148.1981 3179.3999
redmass: 1.0196 3.5390 1.8564 4.8394 2.5824 2.5902 6.1394 4.1384 4.2028 18.9209 5.6701 5.9838 5.7211 4.1675 6.6918 7.2459 6.0773 10.2686 1.3318 7.0341 8.3070 1.1807 1.4932 1.2850 1.5947 1.9279 6.8945 9.2946 3.5197 2.9697 1.2995 1.2638 1.0516 1.2417 1.0685 1.0457 3.8628 6.2283 1.0384 1.0290 1.0971 1.0985 1.1034 1.1054 1.0948
irintensity: 0.5207 5.9577 0.4402 2.5095 0.6888 1.5919 0.6572 1.9755 1.9768 5.3799 3.0984 4.5831 13.6715 1.3362 1.5486 1.1277 0.0156 112.0019 21.5772 18.0361 16.4191 8.2041 14.0855 5.1032 8.7217 35.1775 194.1520 6.9495 127.5611 15.9281 4.1963 26.6958 15.0988 176.1829 10.5053 18.4943 285.9726 303.2829 8.9956 18.8452 12.6067 6.7589 8.9812 10.1055 0.1056
temp: 298.150 k
press: 1.00000 atm
elementType: 17 16 7 7 6 6 6 6 6 6 1 1 1 1 1 1 1
symmnumber: 1
zpe: 315497.8 jmol-1
zpe.correction: 0.120167 hartree
zpe.thermalcorrener: 0.130892 hartree
zpe.thermalcorrenthalpy: 0.131836 hartree
zpe.thermalcorrgfe: 0.082576 hartree
zpe.sumelectzpe: -1199.716102 hartree
zpe.sumelectthermal: -1199.705377 hartree
zpe.sumelectthermalent: -1199.704433 hartree
zpe.sumelectthermalfe: -1199.753692 hartree
dipole: -1.3971 0.6083 0.0070
dipole: 1.5238
quadrupole: -64.2674 -74.3933 -73.9616
quadrupole: -11.9701 0.0098 -0.0013
quadrupole: 6.6067 -3.5192 -3.0875 -11.9701 0.0098 -0.0013
hfenergy: -1199.8362685 hartree
pointgroup: C01 [X(C6H7Cl1N2S1)]
dipole: -0.5988344 -0.0014628 0.0284949 debye
dipolederiv: -0.1394438 -0.0633815 0.0017136 -0.1812351 -1.0002146 -0.002486 0.0004046 -0.0073147 -0.0832751 -0.6803162 -0.1454142 0.0251049 -0.3375948 0.0143488 0.0148822 0.0237474 0.0071246 -0.0608676 -1.421105 -0.138856 0.0523436 0.2157944 -0.446886 -0.0123216 0.0563228 0.0028004 -0.1775691 -1.0067481 -0.4911404 0.033392 -0.7481404 -1.0615292 0.0216197 0.0310089 0.0108046 -0.108468 0.9305411 0.0319519 -0.0376812 -0.1647699 0.8134136 0.0157598 -0.0402714 0.007424 0.0625661 -0.3836627 0.2196934 0.0141632 0.133458 -0.9083792 -0.0148928 0.0132585 -0.0185277 -0.1120273 -0.2792456 0.1886744 0.0157836 0.1131704 -0.0632718 -0.0060405 0.0156257 -0.0097519 0.0282851 1.7631567 0.4491222 -0.0710362 0.6318016 0.6097744 -0.0200419 -0.069443 -0.0125806 0.0086375 0.8751575 0.1880795 -0.0335593 0.3464629 1.774266 0.0043101 -0.0317505 0.0109732 0.0530545 0.1620131 -0.092958 -0.0057641 -0.0679052 0.0407668 0.0029989 -0.0060499 0.0038688 0.0437174 -0.0093149 -0.047745 0.007415 -0.0513546 0.1011582 0.0014342 0.0074572 0.0012934 0.1731823 0.04174 0.0114065 0.0847059 0.0055951 0.0625543 0.062691 0.1119497 0.0187939 -0.031422 0.0989042 -0.0914828 0.0002073 -0.0011491 -0.0609974 -0.0017979 0.0010051 0.002211 0.1239386 0.0236297 0.0115284 -0.089615 0.0022815 0.0642395 -0.0613099 -0.1171516 -0.0178979 -0.014979 0.0678263 0.0064718 -0.0397402 0.0809489 -0.0011893 -0.0937711 -0.027968 -0.0687795 -0.0163565 0.0726846 0.0112705 0.0328852 0.0879574 -0.0040983 0.0869245 0.0224219 0.0682987 -0.0185538 -0.1158169 -0.0472207 0.0096816 -0.0653213 0.0660442 0.0020413 0.0094326 0.0012595 0.1301368 unknown
polarizability: 149.4179804|6.3248907|126.8308161|-4.2473243|0.5749674|49.2556895 unknown
InChI: InChI=1S/C6H7ClN2S/c1-4-3-5(7)9-6(8-4)10-2/h3H,1-2H3
charge 0 multiplicity 1
17 atoms
Cl -0.652698 -3.12385 -0.168964
S  2.401132 1.378859 -0.251627
N  -0.285439 1.435865 -0.134275
N  0.710587 -0.788059 -0.202098
C  -1.531512 0.875857 -0.086424
C  -1.703318 -0.539094 -0.094821
C  -2.717007 1.81056 -0.02359
C  0.776467 0.577015 -0.190022
C  -0.528079 -1.309393 -0.154351
C  3.522021 -0.124665 -0.311628
H  -2.69448 -0.997098 -0.05672
H  -3.311393 1.634298 0.892518
H  -2.362118 2.851633 -0.028672
H  -3.391488 1.652821 -0.886006
H  3.305077 -0.723532 -1.207821
H  3.378123 -0.739971 0.588107
H  4.547925 0.277853 -0.349706
