program: Gaussian 09
title: 000241195
version: EM64L-G09RevD.01
frameworkgroup: C1[X(C23H17N)]
method: RPBEPBE
basis: SDD
operation: Freq
keyword: #pfreq=noraman
keyword: PBEPBE/SDD
title: #p freq=noraman PBEPBE/SDD
converged: YES YES NO NO
title: Mulliken charges:
elementType: N C C C C C C C C C C C C C C C C C C C C C C C H H H H H H H H H H H H H H H H H
charge: -0.503362 0.068762 0.298483 -0.686938 0.136926 0.157604 0.264370 0.330992 -0.572940 0.206683 0.329267 -0.403527 -0.421674 -0.448423 -0.369708 -0.260888 -0.240932 -0.220756 -0.233532 -0.377082 -0.416764 -0.244440 -0.243283 -0.246290 0.254809 0.251713 0.270305 0.314185 0.237717 0.240047 0.243003 0.230601 0.221757 0.223417 0.221726 0.223100 0.249443 0.230011 0.228170 0.226488 0.230959
chargesum: 0.00000
title: Mulliken charges with hydrogens summed into heavy atoms:
elementType: N C C C C C C C C C C C C C C C C C C C C C C C
charge: -0.189177 0.068762 0.298483 -0.180416 0.136926 0.157604 0.264370 0.330992 -0.302635 0.206683 0.329267 -0.165810 -0.181627 -0.205420 -0.139107 -0.039131 -0.017515 0.000970 -0.010432 -0.127639 -0.186754 -0.016270 -0.016795 -0.015330
polarizability: 3.40480756e+02 1.41573228e+01 3.32983303e+02 -1.83787343e+01 -9.66279788e+00 1.55503611e+02
1716.lowfreq: -6.9822 0.0004 0.0007 0.0008 1.6553 2.5899 18.4391 28.5261 41.7687
frequency: 18.3820 28.4809 41.7526 61.9684 67.6035 92.1378 145.8649 177.8224 190.9231 211.5532 220.0610 278.3755 300.3431 310.7604 340.3598 365.3920 404.3816 417.8477 426.1600 437.5616 464.5364 514.2186 536.0296 549.1673 557.2398 568.7453 583.9041 592.5990 608.5111 614.6349 635.7763 671.9413 691.2440 697.7466 723.9356 751.1953 757.6451 763.7543 766.9208 776.4714 814.5139 844.1029 847.9047 851.7466 864.4939 868.8034 884.6861 905.5097 917.1518 930.1463 933.3117 951.3668 958.5609 972.3288 972.8093 983.3509 987.7217 994.1893 1010.8375 1017.9433 1025.4373 1069.4077 1082.7426 1099.1416 1111.2813 1117.2437 1164.2196 1166.2548 1173.1861 1174.3029 1177.6512 1194.1959 1202.9904 1221.8700 1242.3032 1251.0920 1286.5110 1297.8802 1299.9902 1322.9216 1329.2754 1375.4550 1391.3498 1413.0843 1416.5622 1417.8270 1436.5320 1450.3623 1454.1243 1463.0083 1477.1315 1485.3465 1541.1286 1578.6817 1583.6187 1589.8093 1613.7071 1616.4444 1622.0000 1629.3527 2982.7309 3025.8092 3117.3932 3119.0773 3124.4367 3126.7485 3130.9723 3132.4019 3140.3626 3143.3962 3145.7523 3159.0302 3161.5913 3162.1700 3163.0045 3190.8952 3602.1864
redmass: 3.7972 4.7011 4.3426 5.0552 4.3856 4.8904 4.9081 4.3443 5.0181 2.5334 5.4250 6.1369 5.1983 4.5337 4.7343 4.7013 2.8173 2.4056 3.0301 2.9135 3.9679 3.7452 1.2504 4.2103 3.2437 5.2871 3.6755 6.3823 4.4408 6.4078 5.9736 6.0250 4.3830 1.7844 1.9661 1.4331 3.8623 2.7787 1.9409 2.1190 4.5258 1.2847 4.7764 1.5077 1.3233 4.6632 2.8620 2.3328 1.5820 1.6430 1.3833 1.7556 2.9513 1.3077 1.4090 1.3286 4.8680 1.3629 2.2114 2.2067 2.4474 2.4810 1.6751 1.8772 1.3834 1.3716 1.1925 1.1195 1.0858 1.6254 1.6210 1.1312 1.8190 2.1997 2.6865 1.5802 3.1267 1.6998 2.7620 1.7532 1.7994 5.3527 3.5328 5.2412 2.1285 1.3769 2.4463 2.6882 3.3840 3.1606 2.5953 3.2977 5.7187 5.9011 6.2571 6.7852 6.1361 7.7826 7.4956 7.2855 1.0614 1.0977 1.0866 1.0853 1.0849 1.0894 1.0874 1.0890 1.0947 1.0937 1.0953 1.1001 1.0968 1.0994 1.1001 1.0940 1.0801
irintensity: 0.2657 0.2769 0.1084 0.2571 0.7399 0.4123 0.1758 0.1745 0.4998 3.4867 0.9945 0.5299 0.3920 2.3626 0.9547 1.1689 0.3086 11.6610 4.0902 3.1084 6.9683 4.4515 78.4050 27.2826 0.8329 11.4823 2.7693 4.4969 5.5807 1.3345 1.5782 1.0703 4.8400 45.4865 32.2865 103.4301 8.0592 25.1748 37.4785 28.9987 2.7233 0.3134 2.6321 0.4655 0.0492 1.5674 11.8106 7.5381 4.7383 9.5510 2.1122 2.9489 1.8558 0.1085 0.5254 0.0647 0.4600 0.0612 8.7346 5.9348 11.4779 1.0664 10.1492 4.5850 0.9269 5.6890 0.4601 2.4442 0.0776 5.3392 15.2306 0.6095 12.4689 3.4905 28.1794 18.2586 1.5926 1.6358 12.3530 12.3476 24.5164 5.5639 8.2710 34.4934 7.2941 21.0238 15.4446 16.4642 5.0239 18.9055 18.4435 4.2749 7.6727 1.6402 3.6110 0.2140 30.9946 6.0089 12.1469 0.8517 9.2961 5.4381 9.0211 2.8650 1.3023 3.6495 0.3344 3.1791 33.3186 27.9359 36.6936 54.8742 11.2118 43.8037 30.2780 5.5892 47.9146
temp: 298.150 k
press: 1.00000 atm
elementType: 7 6 6 6 6 6 6 6 6 6 6 6 6 6 6 6 6 6 6 6 6 6 6 6 1 1 1 1 1 1 1 1 1 1 1 1 1 1 1 1 1
symmnumber: 1
zpe: 855741.5 jmol-1
zpe.correction: 0.325935 hartree
zpe.thermalcorrener: 0.344199 hartree
zpe.thermalcorrenthalpy: 0.345143 hartree
zpe.thermalcorrgfe: 0.277744 hartree
zpe.sumelectzpe: -939.809360 hartree
zpe.sumelectthermal: -939.791096 hartree
zpe.sumelectthermalent: -939.790152 hartree
zpe.sumelectthermalfe: -939.857551 hartree
dipole: -1.7687 1.2680 0.4617
dipole: 2.2247
quadrupole: -120.5693 -130.6544 -138.4629
quadrupole: -2.6093 -2.8630 -3.3610
quadrupole: 9.3263 -0.7589 -8.5674 -2.6093 -2.8630 -3.3610
hfenergy: -940.1352949 hartree
pointgroup: C01 [X(C23H17N1)]
dipole: 0.5306615 -0.6658543 0.2028156 debye
polarizability: 341.7962755|8.607227|325.8623179|37.1726512|12.3735633|161.3090769 unknown
InChI: InChI=1S/C23H17N/c1-2-8-16(9-3-1)23-22(20-12-6-7-13-21(20)24-23)19-14-17-10-4-5-11-18(17)15-19/h1-14,24H,15H2
charge 0 multiplicity 1
41 atoms
N  2.900214 -0.619586 0.159275
C  0.826494 0.32274 -0.063065
C  -0.625997 0.570208 -0.131523
C  -1.400912 1.155694 1.057321
C  1.815485 1.379885 0.102029
C  1.527871 -0.904016 -0.021606
C  -2.81512 1.301518 0.525434
C  -2.842426 0.838345 -0.828361
C  -1.486287 0.403322 -1.194114
C  3.105975 0.758484 0.224226
C  1.085931 -2.311139 -0.017983
C  1.729029 2.797615 0.127743
C  -3.981951 1.785979 1.138678
C  -4.044176 0.862242 -1.571862
C  4.296358 1.504814 0.364968
C  2.910444 3.5488 0.277291
C  -5.189176 1.809187 0.391849
C  4.18094 2.909528 0.395633
C  -5.217325 1.351981 -0.949305
C  -0.049245 -2.754405 -0.753048
C  1.814461 -3.279833 0.735765
C  -0.439191 -4.10957 -0.73329
C  1.42961 -4.636382 0.744401
C  0.299028 -5.060834 0.008346
H  -1.347551 0.473763 1.929797
H  -0.967443 2.117855 1.395068
H  -1.201603 0.042843 -2.186555
H  3.632765 -1.325353 0.121992
H  0.761726 3.299438 0.013546
H  -3.968721 2.142326 2.175495
H  -4.071213 0.510847 -2.609644
H  5.274452 1.018266 0.450457
H  2.859951 4.643074 0.296606
H  -6.108764 2.184298 0.855175
H  5.082428 3.522145 0.507987
H  -6.159574 1.379488 -1.508536
H  -0.619385 -2.036675 -1.345808
H  2.661196 -2.962486 1.356538
H  -1.317362 -4.425232 -1.307593
H  2.002343 -5.359089 1.336437
H  -0.003076 -6.113785 0.015633
