program: Gaussian 09
title: 000241164
version: EM64L-G09RevD.01
frameworkgroup: C1[X(C11H10N2OS)]
method: RPBEPBE
basis: SDD
operation: Freq
keyword: #p
keyword: freq=noraman
keyword: PBEPBE/SDD
title: #p freq=noraman PBEPBE/SDD
converged: YES YES NO NO
title: Mulliken charges:
elementType: S O N N C C C C C C C C C C C H H H H H H H H H H
charge: 0.168261 -0.223511 -0.396687 0.031340 0.348376 0.339423 -0.433203 -0.405499 -0.380623 -0.238576 -0.229440 -0.226883 0.021423 -0.228939 -0.820587 0.338198 0.260991 0.239017 0.255844 0.235550 0.236809 0.238613 0.265452 0.339865 0.264787
chargesum: 0.00000
title: Mulliken charges with hydrogens summed into heavy atoms:
elementType: S O N N C C C C C C C C C C C
charge: 0.168261 -0.223511 -0.058490 0.031340 0.348376 0.339423 -0.172212 -0.166482 -0.124779 -0.238576 0.006110 0.009927 0.021423 0.009674 0.049518
polarizability: 2.35642935e+02 7.67355149e+00 1.73453479e+02 -4.35856151e+00 7.31637940e+00 7.24393696e+01
1716.lowfreq: -9.5032 -4.9600 0.0003 0.0021 0.0023 2.2014 39.6754 51.8460 80.2574
frequency: 39.5544 51.7862 80.2565 87.6942 130.8571 146.1534 161.6416 174.1570 238.8980 255.2632 306.7370 368.6208 393.3358 404.0898 466.7816 522.4272 581.5217 594.4033 611.7893 616.7562 634.6956 655.5105 658.6403 701.8309 731.7122 775.0746 800.4231 845.4461 855.8645 873.9205 928.7949 979.1836 983.5555 989.4125 989.7309 1002.8089 1012.4806 1023.3106 1041.8431 1088.2178 1116.6252 1177.7048 1195.7912 1212.5768 1253.7081 1318.0944 1335.2709 1342.1010 1382.7631 1424.5881 1443.5542 1449.8655 1472.0524 1482.9123 1549.1793 1580.7711 1601.6308 1613.9552 1629.4850 2986.9320 3117.6738 3119.7911 3135.5966 3146.2162 3157.2390 3158.0265 3171.7773 3191.2081 3528.1312
redmass: 3.8572 3.6236 5.1476 5.1294 3.1030 1.5106 4.2048 4.4167 4.8331 5.9861 6.9074 7.0003 7.1266 2.8781 4.7003 6.5864 6.2502 3.7719 2.0177 3.2156 5.3352 5.4896 8.0054 1.7713 3.7188 1.9019 7.5165 3.2567 1.5512 1.5703 1.4369 1.7292 4.6071 2.1340 1.6086 1.3345 1.5052 2.3046 2.1417 1.6175 4.1827 1.0540 1.1336 2.6930 1.9770 1.4677 1.2458 1.6733 6.6244 2.9287 2.7868 1.0557 1.0563 2.3160 3.9183 6.1590 9.6818 6.2470 6.5257 1.0342 1.0965 1.0883 1.0864 1.0913 1.0961 1.1071 1.1016 1.0928 1.0781
irintensity: 1.0344 1.3658 2.0915 3.3752 0.1723 0.9075 0.3106 10.0750 4.7389 1.7496 1.5503 5.7381 14.0153 0.6157 12.2425 3.8101 2.0224 14.5309 42.7399 19.2902 15.8289 21.5821 6.1785 43.6098 0.0643 65.9486 20.4890 2.5825 2.3498 29.7247 2.4803 6.2627 20.0592 2.3262 5.5176 0.1787 14.0300 9.2734 39.3484 7.0483 18.3331 0.1067 3.9617 249.6398 4.1472 3.8310 10.6358 5.1199 0.4773 136.3919 133.7549 5.0891 15.2631 24.9860 520.6104 13.9190 57.2928 21.6247 369.0586 57.9037 1.4508 8.9386 0.1010 10.4271 22.4873 11.0977 18.7213 3.3317 42.1388
temp: 298.150 k
press: 1.00000 atm
elementType: 16 8 7 7 6 6 6 6 6 6 6 6 6 6 6 1 1 1 1 1 1 1 1 1 1
symmnumber: 1
zpe: 491069.5 jmol-1
zpe.correction: 0.187038 hartree
zpe.thermalcorrener: 0.200605 hartree
zpe.thermalcorrenthalpy: 0.201549 hartree
zpe.thermalcorrgfe: 0.145428 hartree
zpe.sumelectzpe: -1006.901616 hartree
zpe.sumelectthermal: -1006.888050 hartree
zpe.sumelectthermalent: -1006.887106 hartree
zpe.sumelectthermalfe: -1006.943227 hartree
dipole: -4.5169 -5.3226 0.7258
dipole: 7.0185
quadrupole: -78.4759 -105.8893 -96.9895
quadrupole: -11.8052 0.3489 4.6944
quadrupole: 15.3090 -12.1044 -3.2046 -11.8052 0.3489 4.6944
hfenergy: -1007.0886545 hartree
pointgroup: C01 [X(C11H10N2O1S1)]
dipole: 2.0177843 1.6823207 -0.8503898 debye
dipolederiv: -0.4708849 0.2560382 -0.0778172 0.4382479 -0.4952976 0.1129329 -0.1788816 0.1451089 -0.1693772 -0.7431908 -0.3529837 0.1984872 -0.2763381 -1.0442489 0.3278027 0.1301875 0.3352366 -0.5319145 -1.2693812 0.4445374 -0.0744013 0.2049246 -0.6774655 0.2075582 0.0820887 0.2170473 -0.2952934 -0.5289306 0.0528076 0.0017048 0.4277409 -1.4996337 0.5071102 -0.1577381 0.5775944 -0.4531513 0.8119571 -0.1584333 -0.0299453 -0.133028 0.697422 -0.2161136 -0.1287355 -0.2839725 0.1747818 0.0165574 0.067541 -0.0200416 0.0826455 -0.0133171 -0.0168659 0.0335881 0.0187254 -0.0005775 -0.8612755 -0.3310328 0.1984906 -0.118358 -0.2846786 0.0763806 0.1151188 0.095906 -0.2298142 -0.0500273 -0.0170242 0.0767821 0.0706342 -0.1378389 -0.0604832 0.0445522 -0.0591321 -0.0304303 -0.1129416 0.0145338 -0.0528669 -0.0640442 -0.0888292 -0.0761463 -0.0031647 -0.0672618 -0.0049176 1.2113632 -0.2444232 0.0193142 -0.6883857 1.3470421 -0.5001942 0.1993754 -0.5662488 0.2640474 -0.108901 0.0294595 -0.0550424 0.0718328 -0.0608857 -0.1174405 -0.1207669 -0.1269052 0.0514153 0.0156354 -0.0587213 0.1043365 -0.0623916 -0.0725866 -0.0888882 0.1331618 -0.0855131 -0.0023875 1.3597209 0.2488295 -0.2308647 0.0075386 1.5519105 -0.5963278 -0.0513613 -0.6227608 0.5243547 0.0702356 0.0121032 -0.0176299 -0.005427 -0.1214121 -0.04263 0.0103255 -0.0392834 -0.084177 0.2982768 -0.0698871 0.0005658 0.076978 -0.1612206 0.1028652 -0.0558586 0.1159858 0.0540475 0.279967 -0.0200201 0.0091075 -0.0438609 0.1904871 0.046871 -0.0312338 0.049497 0.2851635 0.0026987 0.0855154 -0.0169369 0.1060057 0.0579754 0.0244937 -0.020554 0.035255 0.1453942 0.0143053 0.054657 -0.0945378 0.039864 0.1016069 0.0709032 -0.1170593 0.0625006 0.0422067 0.0892332 -0.0441448 0.066674 -0.0235948 0.0926797 0.0855426 0.0594697 0.0693438 0.0197054 0.0447639 -0.0308374 0.0482904 -0.0518073 0.087903 0.1099076 0.0702458 0.1096907 -0.012447 -0.0128128 0.0451081 -0.0694987 0.0597888 0.1059242 0.0811096 -0.0913637 0.0821037 0.0285815 -0.1164752 -0.0197156 0.0273625 -0.0245216 0.1376587 0.0370165 0.0255852 0.031738 0.1114839 -0.0387185 0.0622489 0.042752 0.0404893 0.0396584 -0.1001507 0.0724512 -0.1002119 0.0289696 0.1641105 -0.0502564 0.0194201 -0.1358013 0.1137876 0.0211018 0.0588379 0.0115354 0.1137365 -0.0652855 0.0241002 -0.0737051 0.000868 0.1333587 0.0036447 -0.0782705 -0.0059791 -0.0294003 unknown
polarizability: 235.7830101|-6.0223091|141.3613817|-10.2340806|-46.7319181|104.3913926 unknown
InChI: InChI=1S/C11H10N2OS/c1-15-11-12-9(7-10(14)13-11)8-5-3-2-4-6-8/h2-7,12H,1H3
charge 0 multiplicity 1
25 atoms
S  -2.886065 2.332356 -0.500484
O  -2.471156 -2.339581 1.574459
N  -0.615748 0.916673 -0.050997
N  -2.624986 -0.202689 0.591078
C  0.19486 -0.168226 0.328828
C  1.657524 -0.021243 0.119408
C  -0.422127 -1.285495 0.858413
C  2.169179 0.715017 -0.984971
C  2.571654 -0.61763 1.029232
C  -1.999359 0.830984 0.091829
C  3.561393 0.850534 -1.172439
C  3.961925 -0.484018 0.83702
C  -1.882885 -1.352045 1.051253
C  4.46285 0.252853 -0.262028
C  -4.646805 1.847651 -0.047105
H  -0.183128 1.788444 -0.365184
H  0.162846 -2.166928 1.129145
H  1.486195 1.141256 -1.730327
H  2.189537 -1.162019 1.899271
H  3.941195 1.410022 -2.033944
H  4.654435 -0.944175 1.549834
H  5.543169 0.358855 -0.407521
H  -5.026243 2.562826 0.695787
H  -4.578393 0.829081 0.37543
H  -5.253868 1.856195 -0.962889
