program: Gaussian 09
title: 000241188
version: EM64L-G09RevD.01
frameworkgroup: C1[X(C17H11BrCl3N3S)]
method: RPBEPBE
basis: SDD
operation: Freq
keyword: #p
keyword: freq=noraman
keyword: PBEPBE/SDD
title: #p freq=noraman PBEPBE/SDD
converged: YES YES NO NO
title: Mulliken charges:
elementType: Br Cl Cl Cl S N N N C C C C C C C C C C C C C C C C C H H H H H H H H H H H
charge: 0.038926 -0.045055 -0.043878 -0.058381 0.268423 -0.445516 -0.061024 -0.002543 0.554952 -0.871077 0.616317 0.371938 -0.351366 -0.371589 -0.429224 -0.225867 -0.342650 -0.350900 -0.207063 -0.207265 -0.121996 -0.196052 -0.100581 -0.262122 -0.219729 0.307709 0.276690 0.317279 0.267181 0.238923 0.353796 0.254644 0.255966 0.261497 0.265004 0.264631
chargesum: 0.00000
title: Mulliken charges with hydrogens summed into heavy atoms:
elementType: Br Cl Cl Cl S N N N C C C C C C C C C C C C C C C C C
charge: 0.038926 -0.045055 -0.043878 -0.058381 0.268423 -0.128236 -0.061024 -0.002543 0.554952 -0.286679 0.616317 0.371938 -0.084185 -0.132666 -0.429224 0.127929 -0.342650 -0.350900 0.047581 0.048701 -0.121996 0.065445 -0.100581 0.002882 0.044902
polarizability: 4.01125900e+02 2.05982264e+01 3.24691664e+02 -1.97070973e+01 -2.07099840e+01 1.62583650e+02
1716.lowfreq: -5.7373 -2.0766 -0.0032 -0.0024 -0.0017 3.2720 9.9502 14.1901 16.8904
frequency: 9.3737 13.6868 16.7987 26.3236 50.4915 57.3421 73.4595 78.1240 92.5294 100.6923 122.5569 129.8824 171.7262 189.1896 210.0494 232.7773 246.7912 255.6014 286.2854 299.1225 309.4447 315.3246 332.1853 360.5965 383.0982 406.4544 408.8291 420.3771 429.5436 445.8359 469.1503 493.4489 512.8899 573.1865 579.9271 610.8548 626.2032 632.4337 643.9976 646.4591 695.7054 711.3565 723.6745 724.3778 735.7831 764.5681 796.3712 800.1196 831.5855 843.8514 876.3982 885.8745 917.1294 926.0669 938.0597 938.5209 956.0784 969.9128 974.6568 1001.0285 1010.3278 1071.7454 1078.3795 1103.0960 1132.5129 1160.6252 1178.6834 1184.7808 1192.1398 1221.2441 1229.1951 1246.3498 1261.5803 1290.7024 1298.4501 1330.3516 1361.1944 1378.7353 1399.6082 1402.0014 1420.1716 1437.4056 1443.5666 1467.4908 1477.5807 1520.2311 1546.6955 1586.2499 1587.7057 1600.1418 1608.2000 3045.0847 3123.2364 3131.4234 3148.4061 3158.1225 3167.4777 3169.9215 3173.1693 3187.2388 3189.0677 3428.0524
redmass: 10.3446 10.8678 12.6733 5.6632 12.1869 8.5058 6.6645 10.7851 12.4409 13.6436 16.8594 9.7468 11.5987 8.7503 10.5515 6.2304 9.3082 5.3537 9.7734 8.6733 21.2465 6.3049 6.9255 2.4674 8.6631 6.8785 3.0155 5.8577 3.7078 3.2588 10.1193 4.0789 8.6241 4.4055 7.9705 4.7983 6.7634 6.8612 5.8744 7.4136 2.3024 7.9607 4.8829 4.9302 2.2645 4.9188 1.3270 4.4999 1.2911 1.5763 1.7867 6.5039 1.4074 1.3517 4.3530 1.5899 1.3572 7.1954 1.3767 4.3699 6.7600 2.7249 1.8716 1.3658 1.4243 2.1361 1.3827 1.1360 4.1809 3.0862 2.2284 1.2097 1.6637 4.8413 1.2805 2.1749 4.1425 7.2588 2.6889 4.2243 4.9674 2.4001 1.1335 3.7044 2.4709 5.8527 5.3826 6.9520 3.5468 6.2081 5.0853 1.0586 1.1069 1.0903 1.0893 1.0937 1.0892 1.0956 1.0967 1.0971 1.0940 1.0756
irintensity: 0.1470 0.0485 0.0086 0.0079 0.2085 0.7145 0.0405 0.1166 0.5311 0.1671 1.6455 2.1325 0.5151 0.0297 1.2228 2.4078 0.9585 1.7873 0.9565 2.4814 0.2015 0.4604 3.5915 7.3619 18.1884 0.5565 0.3936 5.2265 5.5719 14.9134 34.7268 27.1508 11.7402 1.6226 9.9552 49.8052 0.3527 15.8519 2.0960 7.8092 17.3801 21.4712 6.4184 17.5467 19.9168 36.9313 49.2879 34.4733 4.2032 55.2168 0.4402 46.5395 11.9261 10.1866 52.4816 21.4923 0.4611 47.7326 3.8605 43.5292 76.6068 45.2669 24.1607 17.1906 3.8417 185.1401 67.5373 2.3382 35.1430 8.8187 4.0082 6.5783 19.5485 10.3015 1.1043 344.4034 27.9931 0.4922 4.3849 22.0247 143.9611 90.1578 24.4270 124.5067 94.3580 554.6598 440.5615 17.7339 263.0262 17.5362 324.7767 18.5346 0.7112 8.9455 0.7627 8.0797 0.5039 5.7377 2.0014 1.3939 47.9035 92.9796
temp: 298.150 k
press: 1.00000 atm
elementType: 35 17 17 17 16 7 7 7 6 6 6 6 6 6 6 6 6 6 6 6 6 6 6 6 6 1 1 1 1 1 1 1 1 1 1 1
symmnumber: 1
zpe: 630566.6 jmol-1
zpe.correction: 0.240170 hartree
zpe.thermalcorrener: 0.263603 hartree
zpe.thermalcorrenthalpy: 0.264547 hartree
zpe.thermalcorrgfe: 0.180879 hartree
zpe.sumelectzpe: -2608.625729 hartree
zpe.sumelectthermal: -2608.602296 hartree
zpe.sumelectthermalent: -2608.601352 hartree
zpe.sumelectthermalfe: -2608.685020 hartree
dipole: -2.0576 -1.5157 -1.1176
dipole: 2.7893
quadrupole: -180.0329 -177.4748 -184.4485
quadrupole: 0.4196 -15.0355 -0.5778
quadrupole: 0.6192 3.1773 -3.7965 0.4196 -15.0355 -0.5778
hfenergy: -2608.8658991 hartree
pointgroup: C01 [X(C17H11Br1Cl3N3S1)]
dipole: -0.1162196 -1.0663241 0.2316874 debye
polarizability: 276.2009147|-68.1848249|373.0777995|75.6147016|30.4644142|239.1224994 unknown
InChI: InChI=1S/C17H11BrCl3N3S/c18-13-8-22-17(25-9-10-1-3-11(19)4-2-10)24-16(13)23-15-7-12(20)5-6-14(15)21/h1-8,23H,9H2
charge 0 multiplicity 1
36 atoms
Br -0.609278 -4.248049 -1.737217
Cl 3.491451 -4.911523 -0.010829
Cl 4.142721 0.5140 3.361428
Cl -2.703561 5.899361 -4.133518
S  -1.165787 1.469631 1.256221
N  1.446089 -2.709877 0.168459
N  0.10477 -0.776555 0.583826
N  -2.106882 -0.533863 -0.398761
C  -2.840855 3.042267 -0.474168
C  -2.894628 2.111996 0.711595
C  2.5974 -2.409022 0.929064
C  0.28058 -1.990911 -0.014436
C  -2.963347 2.533194 -1.793822
C  -2.67866 4.440626 -0.294845
C  3.66231 -3.357061 0.946764
C  2.76602 -1.214874 1.683874
C  -1.065345 -0.111864 0.371489
C  -0.774323 -2.514854 -0.842347
C  -2.921206 3.394799 -2.911373
C  -2.633726 5.317763 -1.400722
C  3.955894 -1.023053 2.404006
C  4.843975 -3.148467 1.671745
C  -2.756079 4.776733 -2.695081
C  5.005952 -1.960372 2.420047
C  -1.937603 -1.753902 -1.001138
H  -3.478612 1.201924 0.507508
H  -3.267866 2.606997 1.622215
H  1.482841 -3.612266 -0.323675
H  -3.083719 1.454482 -1.938933
H  -2.583726 4.852952 0.716736
H  1.962719 -0.477457 1.683218
H  -3.017466 3.00146 -3.927447
H  -2.509796 6.395243 -1.259188
H  5.634375 -3.903588 1.656163
H  5.91934 -1.779581 2.991555
H  -2.763073 -2.114591 -1.622112
