program: Gaussian 09
title: 000241132
version: EM64L-G09RevD.01
frameworkgroup: C1[X(C13H9F)]
method: RPBEPBE
basis: SDD
operation: Freq
keyword: #pfreq=noraman
keyword: PBEPBE/SDD
title: #p freq=noraman PBEPBE/SDD
converged: NO YES NO YES
title: Mulliken charges:
elementType: F C C C C C C C C C C C C C H H H H H H H H H
charge: -0.208811 -0.686904 0.312724 0.276224 0.183378 0.182843 -0.578858 -0.417277 -0.359161 -0.391555 0.343856 -0.385869 -0.235474 -0.232904 0.248291 0.248292 0.268839 0.244507 0.241887 0.238126 0.254194 0.226788 0.226867
chargesum: 0.00000
title: Mulliken charges with hydrogens summed into heavy atoms:
elementType: F C C C C C C C C C C C C C
charge: -0.208811 -0.190321 0.312724 0.276224 0.183378 0.182843 -0.310020 -0.175390 -0.114655 -0.153429 0.343856 -0.131675 -0.008687 -0.006037
polarizability: 2.17923683e+02 1.39985117e+00 1.42202761e+02 -3.46278251e-03 -4.90184449e-04 5.70743653e+01
1716.lowfreq: -6.8023 -0.0004 0.0002 0.0008 3.4299 10.5988 75.6377 135.4310 182.0075
frequency: 75.6287 135.4284 182.0060 205.8004 239.5256 327.4286 342.3356 393.3960 422.3968 436.4705 499.9583 503.3234 537.4193 563.2052 578.2746 638.2833 701.0183 701.5787 738.1661 748.4242 775.2324 820.1560 824.2066 864.1998 874.7380 917.0550 934.9390 947.4208 967.0043 987.2238 995.6240 1025.8044 1092.1805 1107.2346 1129.2039 1135.2048 1169.5552 1185.8310 1201.8769 1203.1705 1252.3587 1284.9532 1305.7701 1379.3202 1390.6545 1426.8117 1437.2009 1445.3156 1464.5449 1487.0654 1591.8716 1596.3931 1620.9206 1624.6434 2985.8813 3030.6033 3121.3844 3128.1070 3141.6313 3143.3304 3159.1242 3161.3410 3174.6092
redmass: 6.6415 3.7884 5.7455 5.7322 2.1525 9.0035 5.1088 6.5999 2.7246 2.8737 3.2924 3.9475 6.6372 6.7816 3.1570 6.4991 3.2814 5.8152 1.7070 5.6877 1.8772 4.5898 1.4852 1.4371 1.3508 3.7778 1.6140 1.3849 1.8157 1.3324 6.9645 2.1358 1.9727 1.7051 1.4599 1.1439 1.1292 1.8067 1.9292 2.2530 2.0716 1.7529 1.8946 8.2651 3.5576 1.1699 4.4270 2.4593 2.8131 3.9170 6.6754 7.7806 7.5347 7.3698 1.0609 1.0994 1.0856 1.0896 1.0932 1.0910 1.0933 1.1003 1.0960
irintensity: 0.0211 0.2188 0.0713 0.6998 11.8183 2.0101 0.2250 3.8469 11.8223 0.0187 0.1381 0.6530 7.7068 13.2065 2.4710 0.9942 0.1099 3.3687 44.0643 4.7496 70.1020 0.2292 25.1595 10.7945 11.6553 25.3969 3.5151 0.1101 13.2921 0.1987 3.4508 4.9798 11.5136 14.7822 11.3552 0.0036 0.6898 1.8784 6.0705 30.6618 29.1227 0.8965 3.5411 13.3049 2.7201 16.6101 21.2220 67.5725 27.8755 17.3673 0.6677 21.4498 2.3727 17.2056 12.7053 7.0350 4.3391 3.6882 14.6669 22.5837 4.4697 33.9409 6.1484
temp: 298.150 k
press: 1.00000 atm
elementType: 9 6 6 6 6 6 6 6 6 6 6 6 6 6 1 1 1 1 1 1 1 1 1
symmnumber: 1
zpe: 463443.9 jmol-1
zpe.correction: 0.176516 hartree
zpe.thermalcorrener: 0.186538 hartree
zpe.thermalcorrenthalpy: 0.187482 hartree
zpe.thermalcorrgfe: 0.140968 hartree
zpe.sumelectzpe: -599.696363 hartree
zpe.sumelectthermal: -599.686342 hartree
zpe.sumelectthermalent: -599.685397 hartree
zpe.sumelectthermalfe: -599.731912 hartree
dipole: -2.2512 -0.2937 0.0001
dipole: 2.2703
quadrupole: -84.8388 -66.7175 -85.0550
quadrupole: 1.8680 0.0000 -0.0001
quadrupole: -5.9684 12.1530 -6.1846 1.8680 0.0000 -0.0001
hfenergy: -599.8728798 hartree
pointgroup: C01 [X(C13H9F1)]
dipole: -0.8858359 -0.1145614 0.0000244 debye
dipolederiv: -1.3455701 0.1154776 0.0000206 0.1965209 -0.230007 -0.0000029 0.0000257 -0.0000017 -0.1531703 -0.0083589 0.0000458 0.0000034 -0.0001375 -0.1143383 0.0000016 0.0000032 0.0000028 0.1506206 0.008147 0.0874128 0.0000005 0.237252 0.1689759 -0.0000058 0.0000017 -0.000004 -0.0437748 -0.0894448 -0.1686458 0.000001 -0.2760867 0.0721319 0.0000054 0.0000027 0.0000031 -0.0496477 0.2036373 0.1069244 -0.0000061 -0.1134601 -0.1742764 0.0000033 -0.0000096 -0.0000017 -0.0042265 0.2918251 -0.0994645 -0.000006 0.1012143 -0.0899492 -0.0000017 -0.0000064 0.0000024 0.0088256 -0.1805969 -0.0561681 0.0000024 -0.1951808 -0.0140968 0.0000015 0.0000058 -0.0000025 -0.1715133 0.054552 0.1233614 -0.0000067 0.1110746 0.1068684 -0.0000049 -0.0000083 -0.0000059 -0.1644758 0.0971493 0.0127915 -0.0000041 -0.0217189 0.1102557 -0.0000014 -0.0000005 0.0000004 -0.1431186 -0.0722166 0.0585565 -0.0000026 0.0284477 0.0788139 -0.0000007 -0.0000016 -0.0000007 -0.1580354 1.2926683 -0.1055845 -0.0000217 -0.3289388 0.3175114 0.0000049 -0.0000314 0.0000008 0.0792624 -0.2758107 0.0173185 0.0000044 0.3335526 -0.0827904 -0.000007 0.0000023 0. -0.1638435 -0.0566377 0.0068572 -0.0000028 0.1357348 -0.0143515 -0.0000034 0. -0.0000001 -0.1700903 -0.0323456 -0.0860111 -0.0000036 -0.2020011 0.0197615 0.0000039 -0.0000028 0.0000011 -0.1572268 0.0056544 0.0019501 -0.0036392 0.0039428 0.0231838 0.0869542 -0.0056911 0.1244332 0.0004418 0.0056553 0.0019441 0.0036386 0.0039389 0.0231821 -0.0869552 0.0056906 -0.1244338 0.0004451 0.0727483 0.029875 0.0000009 0.0710447 -0.0248536 0.0000007 0. 0.0000021 0.1778572 0.0703549 0.0806843 0.0000009 0.044103 -0.0619236 0.0000007 0.0000004 -0.0000017 0.1514364 0.0634516 -0.0340694 0.0000025 -0.0860639 -0.1017276 0.0000037 0.0000032 0.000003 0.1544935 0.0722426 -0.0818188 0.0000023 -0.0389417 -0.0854201 0.0000014 0.0000024 0.0000022 0.1535731 0.0048646 -0.0744811 0.0000031 -0.0853937 0.0213753 0.0000027 0.0000029 0.000002 0.1809421 -0.1393042 -0.0420731 0.0000075 -0.0435764 0.0791097 0.0000015 0.0000064 0.0000013 0.1620702 -0.0426651 0.1051171 0.0000045 0.1246732 -0.027435 -0.0000025 0.0000044 -0.0000021 0.159155 unknown
polarizability: 217.9267363|1.3146842|142.1997078|-0.0034633|-0.0004863|57.0743653 unknown
InChI: InChI=1S/C13H9F/c14-11-5-6-13-10(8-11)7-9-3-1-2-4-12(9)13/h1-6,8H,7H2
charge 0 multiplicity 1
23 atoms
F  4.51076 -0.252332 -0.000049
C  -0.293357 -1.837356 0.000042
C  0.873208 -0.856868 0.000014
C  -1.510328 -0.917602 0.000067
C  0.383616 0.486466 0.000014
C  -1.091185 0.447954 0.00005
C  2.253159 -1.122448 -0.000003
C  -2.87737 -1.244753 0.000106
C  1.283958 1.57614 -0.00001
C  -2.044809 1.490456 0.000074
C  3.119252 -0.011805 -0.000022
C  2.674734 1.324472 -0.000029
C  -3.834312 -0.198437 0.000127
C  -3.419235 1.157024 0.00011
H  -0.274514 -2.499172 0.888037
H  -0.274555 -2.499185 -0.887944
H  2.662302 -2.137427 0.000002
H  0.920995 2.609286 -0.000009
H  -3.205929 -2.290711 0.000122
H  -1.732408 2.541002 0.000065
H  3.407312 2.136908 -0.000045
H  -4.903493 -0.438272 0.000154
H  -4.1721 1.953261 0.000126
