program: Gaussian 09
title: 000020904
version: EM64L-G09RevD.01
frameworkgroup: C1[X(C6H15O2P)]
method: RPBEPBE
basis: SDD
operation: Freq
keyword: #p
keyword: freq=noraman
keyword: PBEPBE/SDD
title: #p freq=noraman PBEPBE/SDD
converged: YES YES NO NO
title: Mulliken charges:
elementType: P O O C C C C C C H H H H H H H H H H H H H H H
charge: 1.204576 -0.509850 -0.652092 -0.668423 -0.675266 -0.638579 -0.639519 -0.225971 -0.655913 0.228402 0.257853 0.260913 0.231093 0.218868 0.257533 0.235245 0.220202 0.231779 0.259058 0.197727 0.193164 0.200817 0.232919 0.235464
chargesum: 0.00000
title: Mulliken charges with hydrogens summed into heavy atoms:
elementType: P O O C C C C C C
charge: 1.204576 -0.509850 -0.652092 -0.182168 -0.183260 0.073067 0.071520 0.164919 0.013288
polarizability: 1.03571809e+02 -3.32280368e-01 1.03012149e+02 2.83324581e+00 6.15282578e-01 8.39491359e+01
1716.lowfreq: -20.9515 -15.5149 -5.2144 0.0020 0.0025 0.0029 18.2148 34.6381 52.1155
frequency: 17.7119 34.0920 51.7893 85.9374 105.4587 139.2902 173.4025 182.7547 195.9343 242.2798 255.9828 265.1420 296.0038 325.0041 365.5290 434.4621 576.0651 659.1565 660.0206 749.7602 773.5801 814.5720 886.4451 970.6865 979.0764 998.5293 1011.9753 1023.5802 1034.0813 1059.3545 1073.9970 1104.4790 1128.0531 1230.7886 1246.8101 1254.9133 1258.0089 1269.6050 1353.7189 1391.6446 1397.6529 1400.0638 1422.3944 1432.6686 1456.1867 1469.9538 1470.5877 1474.8347 1485.3734 1486.7244 1490.1783 2933.5585 2987.7280 2992.5233 2993.0377 2993.7090 3001.0769 3004.9617 3061.2632 3064.9836 3089.7010 3090.0343 3091.6611 3099.1247 3100.8678 3109.0299
redmass: 1.7792 2.7706 2.5516 2.9022 3.2679 2.5689 1.4315 1.6098 2.4203 1.3466 1.5305 2.3884 3.3881 4.9894 3.2977 4.0854 4.2453 5.0800 6.2596 1.1903 1.2673 1.0910 3.2937 1.9246 1.3721 1.2202 2.3358 2.9364 2.7323 2.0452 2.4198 2.2047 1.4167 1.2502 1.2222 1.2302 1.2746 1.3235 1.2646 1.2343 1.1799 1.1828 1.0806 1.0824 1.0402 1.0371 1.0365 1.0556 1.0545 1.0481 1.0641 1.0545 1.1060 1.0356 1.0354 1.0362 1.0585 1.0586 1.1027 1.1024 1.1005 1.1004 1.0984 1.1009 1.1010 1.1014
irintensity: 1.0197 1.7376 0.2764 0.1872 1.5149 1.2941 0.6426 9.9048 17.3830 0.9652 0.6318 3.2954 0.2103 9.5682 4.9156 25.0228 6.2140 74.5142 76.9700 0.0441 39.6291 3.0166 98.6610 35.5440 6.8750 2.3968 10.6136 121.8522 40.0296 12.8743 24.2988 15.3556 6.1128 0.2365 7.6576 0.8758 0.7524 2.3202 7.0624 19.5689 20.6551 13.9240 0.7244 19.9601 11.3948 0.2207 28.0106 4.8521 21.1042 10.4919 1.4452 48.5784 57.3932 48.0071 6.3837 27.5960 0.4298 31.3796 0.4898 9.0703 18.4931 30.5523 31.0632 11.4484 32.4449 30.7034
temp: 298.150 k
press: 1.00000 atm
elementType: 15 8 8 6 6 6 6 6 6 1 1 1 1 1 1 1 1 1 1 1 1 1 1 1
symmnumber: 1
zpe: 534010.3 jmol-1
zpe.correction: 0.203394 hartree
zpe.thermalcorrener: 0.216835 hartree
zpe.thermalcorrenthalpy: 0.217779 hartree
zpe.thermalcorrgfe: 0.161718 hartree
zpe.sumelectzpe: -728.527489 hartree
zpe.sumelectthermal: -728.514048 hartree
zpe.sumelectthermalent: -728.513104 hartree
zpe.sumelectthermalfe: -728.569165 hartree
dipole: -1.9094 -0.2552 -5.4990
dipole: 5.8266
quadrupole: -63.5466 -59.4843 -70.4437
quadrupole: -1.2352 -4.9055 -1.0114
quadrupole: 0.9449 5.0072 -5.9522 -1.2352 -4.9055 -1.0114
hfenergy: -728.7308832 hartree
pointgroup: C01 [X(C6H15O2P1)]
dipole: 0.7691173 0.0689333 -2.1584041 debye
dipolederiv: 1.8016211 0.0060779 -0.1689716 0.0254273 1.5606144 -0.0351633 0.1144188 0.006032 1.0766771 -1.473963 -0.0978637 0.1832431 -0.097431 -0.6343956 0.0281105 0.2788813 0.0464548 -0.4824271 -0.6779568 0.0190026 0.0574326 0.017343 -0.7483635 0.0114721 0.0653771 0.0110894 -0.6331632 -0.122671 -0.0084197 0.0030729 0.0137904 -0.2645365 0.0160152 -0.0716681 -0.0397071 -0.1788205 -0.1476338 0.0578558 -0.005016 0.034616 -0.2551727 -0.0182004 -0.0887328 0.0114108 -0.1773049 0.0295266 0.0389583 0.0230261 0.0015452 -0.0515918 -0.0497754 -0.0173533 0.1140396 0.0150441 0.039966 -0.0052675 0.0079154 0.033714 -0.0534164 0.0537698 0.0275283 -0.1083685 0.0108199 0.7212141 0.0283867 -0.1262789 -0.00131 0.397894 -0.0232058 -0.5021324 -0.0770123 0.33103 -0.1441966 -0.037491 -0.0644246 -0.0325253 0.0361117 -0.011139 0.0018164 -0.0005055 0.0421294 0.0129938 0.0012479 0.1279689 0.0034862 0.0121427 0.0236933 0.1153391 -0.0013032 -0.0698572 -0.0676094 -0.0405463 -0.0903832 -0.0032997 0.0287901 -0.0299497 -0.081467 -0.0289497 0.0415679 -0.0738701 0.0030129 -0.0889861 -0.0340243 0.0354954 -0.0040472 -0.0803728 -0.000526 0.0497396 0.0243674 0.0015678 0.1258904 -0.0036415 0.0053708 0.0203864 0.1052283 0.0442598 -0.0743172 0.0871853 0.0714851 -0.0433767 0.0823276 -0.1400006 0.082201 -0.049951 0.0852318 0.0178614 0.0257741 0.0031488 0.0922596 -0.0491991 0.1210136 0.0273587 0.1034538 -0.0360949 -0.0006612 -0.0816867 -0.0808337 -0.0767669 -0.0282866 0.0919031 -0.0236712 -0.0565045 -0.0451526 0.0673901 0.1071705 0.0169723 -0.0157915 0.0060627 -0.1609295 -0.0923783 -0.0215033 -0.0977772 0.0201058 -0.109877 0.0089521 -0.0752582 -0.0418777 0.1020593 -0.0016648 -0.0641611 0.017306 0.0712438 0.0296074 -0.0389254 0.0935291 0.0129867 0.1248938 0.0060804 0.0810358 0.0693571 -0.0072522 -0.0190275 -0.0203628 0.0014475 0.0263276 -0.1420701 -0.1310473 0.0734625 -0.0969616 -0.0422302 -0.0330058 0.0478818 -0.0558954 0.0179183 -0.0677011 0.1332662 0.0356375 0.1203004 -0.1040427 -0.1238475 -0.0252316 0.1011127 -0.0222478 0.1077796 -0.000427 0.1337448 0.0051268 -0.0219807 0.1011655 0.0356971 0.014242 -0.0079553 -0.0851138 -0.0981384 -0.0316358 -0.094921 0.0498008 0.0947532 0.0146948 -0.019991 0.0462532 -0.0207769 0.1164541 -0.0704417 0.0966712 -0.0013524 unknown
polarizability: 103.5584652|-0.3399148|103.0650179|-2.7542271|-0.2582414|83.9096108 unknown
InChI: InChI=1S/C6H15O2P/c1-4-8-9(7,5-2)6-3/h4-6H2,1-3H3
charge 0 multiplicity 1
24 atoms
P  -0.793032 -0.118603 0.153059
O  0.899281 0.178616 0.586855
O  -1.675008 -0.271113 1.478513
C  -1.269868 1.359742 -0.921265
C  -0.756498 -1.669167 -0.92628
C  -1.332303 2.649495 -0.078078
C  -0.33425 -2.902245 -0.101578
C  1.953127 0.232241 -0.447461
C  3.259034 0.546724 0.282823
H  -0.545002 1.445415 -1.751968
H  -2.258199 1.124573 -1.358723
H  -1.781345 -1.793076 -1.323167
H  -0.082104 -1.495129 -1.785078
H  -1.673149 3.49849 -0.69706
H  -2.03417 2.526169 0.764758
H  -0.343261 2.900259 0.343999
H  -0.386193 -3.816098 -0.719799
H  0.696941 -2.798792 0.280218
H  -1.000407 -3.02984 0.76917
H  2.023466 -0.742954 -0.974938
H  1.724195 1.020024 -1.197499
H  4.101409 0.59465 -0.432407
H  3.181511 1.514554 0.806309
H  3.473324 -0.233232 1.032699
