program: Gaussian 09
title: 000244158
version: EM64L-G09RevD.01
frameworkgroup: C1[X(C9H10BrNO2)]
method: RPBEPBE
basis: SDD
operation: Freq
keyword: #p
keyword: freq=noraman
keyword: PBEPBE/SDD
title: #p freq=noraman PBEPBE/SDD
converged: NO YES NO NO
title: Mulliken charges:
elementType: Br O O N C C C C C C C C C H H H H H H H H H H
charge: 0.016913 -0.280984 -0.254737 -0.446767 0.522408 -0.446890 -0.340921 0.427686 -0.354317 -0.306468 0.215201 -0.798120 -0.516001 0.241502 0.313990 0.253424 0.314366 0.238939 0.271055 0.237403 0.233065 0.220758 0.238494
chargesum: 0.00000
title: Mulliken charges with hydrogens summed into heavy atoms:
elementType: Br O O N C C C C C C C C C
charge: 0.016913 -0.280984 -0.254737 -0.132402 0.522408 -0.205388 -0.026931 0.427686 -0.354317 -0.053044 0.215201 -0.050722 0.176316
polarizability: 2.04351701e+02 -7.46333203e-01 1.33525018e+02 6.95076677e-01 -3.67993292e+00 6.09797638e+01
1716.lowfreq: -80.5796 -3.7195 -0.0008 -0.0006 -0.0005 4.2784 6.9328 48.5029 58.6527
frequency: -80.5784 48.4856 58.6377 61.6903 114.0747 120.9968 139.6013 168.0085 187.8655 226.0806 241.8217 307.0421 352.3485 416.0909 447.7371 465.0345 494.4190 573.6592 599.9536 619.5315 637.7161 668.0631 722.0246 747.1172 843.8498 849.9968 864.9014 939.4136 951.5980 984.2644 987.7270 1019.5274 1031.4751 1107.8801 1132.8873 1149.9043 1204.2326 1220.5480 1242.9593 1278.3594 1344.1471 1376.3890 1391.8902 1431.2134 1447.4497 1458.5120 1467.7985 1469.6289 1476.8529 1498.5255 1572.7377 1610.0824 1634.2622 2965.1997 2988.8740 3057.7851 3074.0778 3124.1310 3137.4055 3138.9971 3155.6591 3199.3541 3523.3171
redmass: 1.0474 5.1096 3.5518 3.6517 4.8311 4.5123 1.1642 4.5465 5.0668 12.6100 4.1418 4.0385 7.4082 4.1828 3.5902 5.5068 4.6430 3.2333 2.6540 4.5022 1.3695 6.7126 3.5022 4.9640 3.3207 1.6827 1.6120 6.5507 8.6087 1.3299 1.7062 2.8947 1.6606 1.2370 1.3173 1.3479 2.0931 3.9899 1.4764 2.4140 4.3144 1.2417 4.5020 1.2379 1.1465 1.0586 1.0467 1.0591 2.4259 2.3150 4.7902 6.7009 5.1117 1.0315 1.0384 1.1043 1.0984 1.1011 1.0922 1.0978 1.0909 1.0951 1.0765
irintensity: 0.0090 7.1387 4.8583 7.1904 3.8577 0.4688 0.3354 2.7046 4.9524 0.5107 1.8646 2.9460 2.6268 1.6189 7.4386 9.5017 30.2874 8.7180 28.3016 5.0216 49.9106 11.7067 1.8768 7.5284 12.0864 3.0935 74.1942 9.8191 64.9351 1.5244 48.0340 27.8800 8.3302 1.1086 16.1992 1.5652 70.6494 174.9096 2.2110 3.3555 148.6415 56.2404 18.0432 34.6114 47.4774 13.8561 20.3085 30.9414 96.6674 393.0363 100.4155 51.8360 138.0775 68.9166 8.0472 35.3092 14.7389 28.5997 8.0447 6.3671 4.1590 8.3958 12.9653
temp: 298.150 k
press: 1.00000 atm
elementType: 35 8 8 7 6 6 6 6 6 6 6 6 6 1 1 1 1 1 1 1 1 1 1
symmnumber: 1
zpe: 453216.1 jmol-1
zpe.correction: 0.172621 hartree
zpe.thermalcorrener: 0.185584 hartree
zpe.thermalcorrenthalpy: 0.186528 hartree
zpe.thermalcorrgfe: 0.131241 hartree
zpe.sumelectzpe: -566.649936 hartree
zpe.sumelectthermal: -566.636973 hartree
zpe.sumelectthermalent: -566.636029 hartree
zpe.sumelectthermalfe: -566.691316 hartree
dipole: -0.9299 -2.6266 2.1141
dipole: 3.4976
quadrupole: -83.8891 -78.4514 -88.4098
quadrupole: 18.6310 3.8879 2.3240
quadrupole: -0.3057 5.1320 -4.8263 18.6310 3.8879 2.3240
hfenergy: -566.8225567 hartree
pointgroup: C01[X(C9H10Br1N1O2)]
dipole: 0.5448621 0.9553427 0.8270445 debye
dipolederiv: -0.3647021 0.2822018 -0.0024207 0.3538396 -0.3674786 0.0007129 0.0282776 -0.0162055 -0.0285827 -1.3468635 -0.3381806 0.2536429 -0.2745874 -0.4424851 0.0676833 0.1278326 0.0604555 -0.4029421 -0.7410925 -0.0165255 -0.0139531 0.5921472 -0.9082608 -0.0419328 0.0367763 -0.0546989 -0.3424689 -1.9932448 0.1838723 -0.0227928 0.3174545 -0.3804497 0.0069719 -0.044859 0.0025477 -0.3244039 1.2057895 0.1074857 0.0405406 0.3864159 0.0733536 0.0111001 0.0898765 0.0004348 0.1034205 -0.4585831 0.0240851 -0.0034567 0.2956566 -0.1243478 0.0247955 0.0223456 0.0040161 -0.1436335 -0.2527853 0.046801 0.0092231 -0.2320683 -0.0555973 0.0050891 -0.021638 0.0178243 -0.1595185 0.8524646 0.5864878 -0.0963319 0.3949979 0.0304272 -0.0393766 0.1288664 0.0306719 -0.0250636 0.5408184 -0.5150541 0.0398549 -0.7583645 0.6052455 0.0165906 -0.0564431 0.0492865 -0.115636 -0.0153208 -0.2038292 0.026983 0.1518911 0.0684463 0.0469249 0.0494095 0.0298809 -0.1226553 1.9403686 -0.1479877 0.0451983 -0.9294974 1.1580779 0.0727452 -0.0124168 0.0880262 0.1760541 -0.3878638 -0.1409658 -0.0312403 -0.2806806 -0.1376376 -0.0282849 -0.0444285 -0.023194 0.0537739 0.5478032 0.0978975 -0.1843958 0.0523298 0.3205172 -0.058424 -0.4083645 -0.1802788 0.4823293 0.0530808 -0.0705167 -0.0089744 -0.0758232 -0.0363511 -0.0225976 -0.0123279 -0.0210125 0.1656169 0.1542319 0.0537579 0.007294 0.0294753 0.0889014 -0.0095301 0.0007817 -0.0090167 0.1830754 0.0578453 -0.0260477 -0.0139347 -0.0448558 -0.0491866 -0.0238218 -0.0144416 -0.0239834 0.1523938 0.1692263 0.0229848 -0.0040077 -0.0209872 0.0957519 -0.0226424 -0.0052229 -0.0202469 0.3016666 0.0572569 -0.0009284 -0.0320117 -0.0430653 0.0131418 0.1052095 0.0168987 0.1138597 -0.0107866 -0.0167373 0.0487227 -0.0026582 0.1155374 0.0356839 -0.0030255 0.0018143 -0.0064738 0.1316644 0.0554831 0.0042562 0.0430627 -0.0295002 0.050336 -0.098115 -0.0156259 -0.1039763 -0.0478844 0.0699799 -0.0195586 0.015926 0.0461452 -0.0647507 -0.1330047 0.0952862 -0.0473775 -0.0425037 0.0255355 0.1087748 -0.0501944 0.0289348 -0.0636105 0.1247668 0.0774311 0.1159586 -0.0454751 -0.1526907 -0.0877333 -0.0153531 -0.0753953 0.090273 -0.0018345 -0.0398282 -0.0064981 0.0615595 unknown
polarizability: 202.0259778|-12.5676832|135.831299|-1.4435088|3.9142397|60.9992065 unknown
InChI: InChI=1S/C9H10BrNO2/c1-6(12)11-7-3-4-9(13-2)8(10)5-7/h3-5,11H,1-2H3
charge 0 multiplicity 1
23 atoms
Br -2.885928 2.308437 0.014005
O  -3.270137 -0.835154 -0.386072
O  3.352078 -1.351338 -0.056904
N  2.183479 0.681361 0.086704
C  0.830513 0.2510 -0.015277
C  -0.175603 1.252887 0.049375
C  0.455925 -1.109191 -0.184196
C  -1.925418 -0.457304 -0.208018
C  -1.531325 0.894507 -0.045055
C  -0.909263 -1.439577 -0.277021
C  3.349864 -0.092079 0.063246
C  4.632672 0.728258 0.203067
C  -4.020565 -1.074702 0.865368
H  0.097485 2.307398 0.168131
H  1.230862 -1.874609 -0.242182
H  -1.216984 -2.480008 -0.425225
H  2.317553 1.690028 0.19231
H  4.73998 1.450658 -0.627221
H  5.489494 0.040354 0.185116
H  4.648715 1.291569 1.154462
H  -4.06684 -0.158032 1.48252
H  -3.556432 -1.895301 1.445959
H  -5.033724 -1.363361 0.548209
