program: Gaussian 09
title: 000244143
version: EM64L-G09RevD.01
frameworkgroup: C1[X(C10H10N2O2)]
method: RPBEPBE
basis: SDD
operation: Freq
keyword: #p
keyword: freq=noraman
keyword: PBEPBE/SDD
title: #p freq=noraman PBEPBE/SDD
converged: YES YES NO NO
title: Mulliken charges:
elementType: O O N N C C C C C C C C C C H H H H H H H H H H
charge: -0.284638 -0.299279 -0.376599 -0.004447 0.469637 -0.481712 -0.384713 -0.363307 -0.224385 -0.225879 -0.230326 0.346998 -0.394946 -0.109077 0.224430 0.246581 0.232688 0.269739 0.228451 0.230198 0.231144 0.339047 0.293813 0.266583
chargesum: 0.00000
title: Mulliken charges with hydrogens summed into heavy atoms:
elementType: O O N N C C C C C C C C C C
charge: -0.284638 -0.299279 -0.037552 -0.004447 0.469637 -0.010702 -0.152025 -0.093569 0.004066 0.004319 0.000818 0.346998 0.165450 -0.109077
polarizability: 1.39529537e+02 8.97660945e+00 1.16049173e+02 -1.00215405e+01 6.49840353e+00 1.03533515e+02
1716.lowfreq: -6.2063 -3.7456 -0.0008 -0.0007 -0.0006 9.7870 20.7589 24.6543 51.8274
frequency: 20.6414 24.5674 51.6531 64.9580 82.8064 154.2443 182.1580 224.0140 271.6423 298.8577 349.6588 357.4464 403.4152 424.0723 497.1623 555.1371 581.9500 604.5499 617.6840 641.8699 699.0221 705.8782 758.0308 816.0659 832.5703 858.4412 903.9459 922.2343 938.3305 973.8330 982.8653 990.3432 1001.7993 1023.4029 1027.7091 1091.8016 1122.4764 1174.0684 1189.7971 1200.9083 1223.5517 1239.0813 1250.1605 1331.7311 1343.6527 1352.4336 1386.4699 1443.2146 1446.5681 1462.1327 1484.6922 1487.8249 1595.2380 1614.9855 1653.4308 2201.0714 2993.5082 3039.0607 3055.8123 3113.7324 3119.8917 3129.2220 3141.2698 3152.3317 3166.0995 3578.6974
redmass: 6.5902 4.8610 4.0015 6.8933 9.4136 6.2043 3.8983 5.6863 5.9769 5.1015 3.6107 2.4056 2.8119 3.9743 4.5761 1.4777 2.7049 4.3089 6.2773 5.5051 5.1917 2.2205 2.1399 3.5339 4.3308 1.2481 4.0060 3.5249 1.7274 1.8055 1.4142 5.4814 1.3373 2.5663 2.2321 1.5190 5.8846 1.0543 1.1417 2.0870 2.8174 1.1568 1.1323 1.2579 1.2407 1.2840 8.0606 2.1837 1.0744 1.1338 2.1804 1.9592 6.0975 6.0556 8.6787 12.4017 1.0609 1.0586 1.0992 1.1072 1.0876 1.0871 1.0919 1.0964 1.1016 1.0780
irintensity: 0.6367 2.1681 3.3132 8.5772 4.2982 3.4301 4.3573 3.7695 8.5949 12.0117 0.4580 19.4051 0.0732 0.3703 13.0748 119.9522 26.3695 17.5217 0.2320 4.9699 21.6591 63.0863 70.2314 10.4569 14.7777 0.3408 30.4794 122.2528 15.8831 11.7892 0.8944 0.2018 0.4255 59.4442 2.6291 7.5483 89.2769 0.0162 20.9798 289.8788 25.8672 9.6741 98.3652 1.8721 15.8747 5.4865 0.9264 9.9312 29.5278 11.2524 60.3234 294.8226 1.9233 0.5089 228.9958 1.2924 34.0493 32.9045 5.3059 4.5047 7.1973 1.5345 17.6774 24.7853 19.7235 45.3168
temp: 298.150 k
press: 1.00000 atm
elementType: 8 8 7 7 6 6 6 6 6 6 6 6 6 6 1 1 1 1 1 1 1 1 1 1
symmnumber: 1
zpe: 482261.8 jmol-1
zpe.correction: 0.183684 hartree
zpe.thermalcorrener: 0.196782 hartree
zpe.thermalcorrenthalpy: 0.197726 hartree
zpe.thermalcorrgfe: 0.140985 hartree
zpe.sumelectzpe: -645.993933 hartree
zpe.sumelectthermal: -645.980835 hartree
zpe.sumelectthermalent: -645.979891 hartree
zpe.sumelectthermalfe: -646.036632 hartree
dipole: 1.1427 -2.9960 -1.0327
dipole: 3.3687
quadrupole: -75.0716 -86.1969 -80.3635
quadrupole: 15.7995 -2.9669 6.3787
quadrupole: 5.4724 -5.6529 0.1805 15.7995 -2.9669 6.3787
hfenergy: -646.1776173 hartree
pointgroup: C01 [X(C10H10N2O2)]
dipole: 0.3562885 -1.2414384 0.2973856 debye
dipolederiv: -1.7599081 0.2111291 -0.1208192 0.6895798 -0.6355237 0.0659479 -0.10748 -0.077404 -0.3981663 -0.783379 0.0964309 -0.0859701 0.1176656 -0.5338266 -0.27281 -0.1297868 -0.2108691 -0.8472147 -1.2770954 0.0569935 -0.4119266 0.1038483 -0.4562338 0.1639761 -0.4843064 0.1750991 -0.6902984 -0.2083048 0.007958 -0.0032592 0.0555214 -0.2153387 -0.0029513 -0.0898019 0.021157 -0.2407902 -0.0681432 0.0278306 -0.0479923 -0.0394741 -0.0992909 0.032227 0.0143638 0.1124397 -0.0945668 1.1418405 0.1000645 0.0539947 0.1311274 0.4046086 -0.0940746 0.3389144 -0.1314731 0.3285714 -0.0897904 0.0467816 -0.0270621 -0.0412249 0.0737914 0.0737822 -0.0771425 0.0481746 -0.0941066 -0.0436124 -0.0334764 -0.098282 0.0007718 -0.0710555 0.0069975 -0.0571442 0.0360051 -0.0866534 -0.0071023 -0.0538699 -0.1282345 -0.0687716 -0.0900364 0.0453884 -0.1317902 0.0508746 -0.0349194 -0.1396423 0.0048175 -0.0220512 0.0150032 0.1204438 0.097565 -0.0120217 0.0682657 -0.0984536 -0.0188153 0.0861374 -0.0932124 0.0817476 0.0255398 -0.0157557 -0.0767661 -0.0111382 -0.0846823 2.1641439 -0.4148133 0.5628217 -0.7847274 0.7312299 0.3267038 0.54573 0.2739071 1.2458574 0.7191192 -0.1387251 0.1032973 -0.353567 0.4822466 -0.2081065 -0.1350596 -0.0344705 0.1523899 -0.1608107 -0.0036718 0.026541 0.0593812 -0.0556161 -0.0206191 0.0553627 -0.0383252 0.0265083 -0.0340713 0.0600028 -0.0204372 0.0275854 -0.1016145 0.0330757 -0.0219499 -0.0587561 0.098448 -0.0183835 -0.0384355 0.0599274 -0.0342462 0.0908242 -0.0752823 -0.0379457 0.0278274 -0.0543629 0.1217313 -0.0316122 0.024303 -0.0070596 -0.098408 -0.0666936 0.0255659 -0.0520623 0.1064672 0.0837385 0.0345113 0.1047013 0.0415797 0.0905104 -0.014671 0.1005562 -0.0276796 0.0786948 -0.0093643 0.0323976 0.1258731 0.035112 0.0689775 -0.0550692 0.1394986 -0.0505834 0.0451872 0.1052446 -0.0065675 0.0346129 -0.0301224 -0.0952136 -0.0726448 0.0314102 -0.0741819 0.1055348 0.0011953 -0.1044671 0.0773785 -0.1126078 0.0056763 0.0303634 0.0860782 0.032363 0.109624 0.198206 0.0955983 -0.0497155 0.1012351 0.2857005 -0.0544965 -0.0128562 -0.0624452 0.224969 0.2124453 -0.0234566 -0.0315949 0.0326614 0.055824 0.0047859 0.0722586 -0.0449934 0.0926543 -0.1292417 -0.0115577 -0.0328938 -0.021019 0.0167849 0.0723617 -0.0356872 0.0282687 0.1093083 unknown
polarizability: 142.2883594|1.7246137|118.2822762|-8.4752555|-1.5562255|98.5415904 unknown
InChI: InChI=1S/C10H10N2O2/c11-6-7-12-10(13)14-8-9-4-2-1-3-5-9/h1-5,12H,7-8H2
charge 0 multiplicity 1
24 atoms
O  -0.391094 -1.596532 0.015831
O  -1.350589 0.058749 1.405647
N  -2.402534 -0.714895 -0.545462
N  -3.793034 1.926338 -2.405721
C  1.888441 -0.65155 0.407265
C  0.835101 -1.621036 0.894371
C  2.894689 -1.079142 -0.495663
C  1.881137 0.697486 0.848878
C  3.877323 -0.174412 -0.955618
C  2.862514 1.602659 0.388783
C  3.862544 1.16905 -0.513385
C  -1.37612 -0.674968 0.382955
C  -3.565382 0.160141 -0.409086
C  -3.684749 1.145626 -1.510634
H  1.166803 -2.667881 0.81398
H  0.510536 -1.393968 1.92416
H  2.906169 -2.120836 -0.839755
H  1.096982 1.028746 1.53897
H  4.651818 -0.513983 -1.652254
H  2.84933 2.642577 0.733365
H  4.624826 1.871986 -0.867924
H  -2.301737 -1.327427 -1.355193
H  -3.453449 0.69757 0.551022
H  -4.504023 -0.424695 -0.360228
