program: Gaussian 09
title: 000244141
version: EM64L-G09RevD.01
frameworkgroup: C1[X(C12H7ClO2)]
method: RPBEPBE
basis: SDD
operation: Freq
keyword: #p
keyword: freq=noraman
keyword: PBEPBE/SDD
title: #p freq=noraman PBEPBE/SDD
converged: YES YES NO NO
title: Mulliken charges:
elementType: Cl O O C C C C C C C C C C C C H H H H H H H
charge: -0.038393 -0.186318 -0.200563 0.280899 0.377373 0.022929 -0.484201 -0.374059 -0.335541 0.157731 -0.257497 -0.216663 -0.218321 -0.276893 -0.108574 0.276908 0.250060 0.274589 0.266076 0.260325 0.260686 0.269446
chargesum: 0.00000
title: Mulliken charges with hydrogens summed into heavy atoms:
elementType: Cl O O C C C C C C C C C C C C
charge: -0.038393 -0.186318 -0.200563 0.280899 0.377373 0.022929 -0.207293 -0.124000 -0.060952 0.157731 0.008580 0.043663 0.042365 -0.007447 -0.108574
polarizability: 2.73102870e+02 -2.36226198e+01 1.47923660e+02 -3.28761953e+00 -4.72121833e+00 6.22277185e+01
1716.lowfreq: -8.1053 -2.2384 -0.0014 0.0008 0.0013 2.7118 50.9188 58.0732 69.9457
frequency: 50.9114 58.0701 69.9434 111.6203 158.5864 220.4214 226.5985 264.6030 303.0333 349.7442 396.9512 408.3165 423.2592 435.4827 465.0232 501.4485 544.6874 612.5049 620.3952 633.5103 706.8697 716.6895 769.2595 781.7747 822.0737 823.5658 841.7430 856.1682 916.0809 951.6689 962.2155 969.2832 998.6150 1000.9080 1075.0714 1087.1714 1119.7776 1195.5737 1201.8276 1257.5238 1275.9566 1304.3833 1334.9667 1352.6497 1366.0301 1402.1786 1477.5508 1520.1098 1552.9031 1564.3514 1580.9900 1595.2226 1637.4771 3143.7044 3145.4008 3148.6645 3167.8349 3170.9826 3173.6936 3195.3956
redmass: 7.4444 4.7326 7.1180 9.4180 7.6669 7.8877 11.4876 5.6261 5.0938 5.3725 8.8275 3.0963 5.5191 5.4062 8.4863 3.0182 4.9159 3.7151 4.7379 6.4143 6.8603 3.7977 4.2194 2.9020 1.4782 1.4377 4.0185 2.2628 1.5907 1.4888 1.6033 2.4189 1.3035 3.7319 2.7196 1.6729 1.3783 1.3788 1.4480 1.8771 2.7402 1.2995 2.9106 2.1322 5.1533 3.6294 2.4246 10.7006 8.3991 6.8265 8.4953 6.2366 7.0014 1.0899 1.0870 1.0909 1.0906 1.1012 1.0963 1.0956
irintensity: 0.0909 0.3513 6.0168 6.2783 0.1676 1.0328 1.8496 0.8815 0.2412 0.6203 50.9385 0.9887 3.1072 4.4322 1.9533 10.6300 5.1213 7.8405 6.6160 3.6939 18.5126 2.5556 11.1093 0.7676 14.0909 12.9526 3.9991 60.9411 40.1444 7.3841 1.7117 33.3513 0.0886 31.7443 145.0229 37.0860 9.4971 7.8514 0.0230 45.4901 96.5400 5.9667 43.9585 7.5389 15.3190 11.1360 73.1182 37.7629 287.0073 98.6428 112.7654 66.8458 8.8304 4.9056 0.6231 4.1396 1.7119 9.6777 2.4285 0.9507
temp: 298.150 k
press: 1.00000 atm
elementType: 17 8 8 6 6 6 6 6 6 6 6 6 6 6 6 1 1 1 1 1 1 1
symmnumber: 1
zpe: 400865.1 jmol-1
zpe.correction: 0.152681 hartree
zpe.thermalcorrener: 0.165008 hartree
zpe.thermalcorrenthalpy: 0.165952 hartree
zpe.thermalcorrgfe: 0.112786 hartree
zpe.sumelectzpe: -1070.928166 hartree
zpe.sumelectthermal: -1070.915840 hartree
zpe.sumelectthermalent: -1070.914896 hartree
zpe.sumelectthermalfe: -1070.968062 hartree
dipole: 0.3656 0.5337 -0.0980
dipole: 0.6543
quadrupole: -97.6489 -97.6789 -93.5373
quadrupole: 11.4878 1.7333 -6.0385
quadrupole: -1.3605 -1.3905 2.7511 11.4878 1.7333 -6.0385
hfenergy: -1071.0808479 hartree
pointgroup: C01 [X(C12H7Cl1O2)]
dipole: 0.1437064 -0.1500681 0.1519784 debye
dipolederiv: -1.0995186 0.0423485 0.0136699 0.0755504 -0.0755327 0.0237621 -0.004986 0.0222296 -0.1021414 -0.5922262 -0.1154844 0.0474326 -0.0037229 -0.6774648 0.1785313 0.094275 0.1821467 -0.3841191 -0.9652019 -0.1343981 0.0903279 -0.4598151 -0.6172299 0.1635864 0.217349 0.1556109 -0.4147984 0.9573934 0.1898026 -0.1112773 0.2663156 -0.209183 0.1208594 -0.2516252 0.130554 -0.0669123 -0.5758349 -0.045874 0.0507994 0.1997172 -0.0557139 0.0180541 -0.0283569 0.0296265 -0.0318209 0.8683247 0.0325692 -0.015531 -0.0906896 0.7443348 -0.2373603 -0.0888455 -0.2809596 0.325237 -1.2641303 -0.0865302 0.0621421 -0.2671943 0.0514884 -0.057621 0.2703014 -0.0690174 -0.1006745 0.2693901 0.0190526 -0.0786913 -0.3047523 -0.1154115 -0.0522691 0.1832016 -0.0386622 0.0057528 0.3201037 -0.0508423 0.0534731 0.1720435 -0.028964 -0.1046868 -0.1641237 -0.0465254 0.0077035 1.7157468 0.0396505 -0.0702746 0.1019591 0.6719768 -0.2495825 0.0025854 -0.2445819 0.3420533 -0.4318396 -0.103903 0.0591589 -0.0494777 0.0798175 -0.1017368 0.0299978 -0.0923435 -0.0617223 -0.6028985 -0.0497981 0.1126515 -0.0931493 -0.0755571 -0.0399621 0.254073 -0.0395826 -0.0382153 -0.5141282 0.0874949 -0.1213875 0.1705198 -0.0833893 -0.0401617 -0.2561569 -0.0362919 -0.0270285 0.1702203 0.1324054 -0.0735092 0.2096778 -0.2452453 0.0641135 -0.1299422 0.0769868 -0.1378387 1.5597929 -0.0799431 -0.0180051 -0.0954203 0.0127606 -0.0987842 -0.0470652 -0.1115004 0.1330874 0.0166636 0.0578766 -0.0212266 0.0922146 0.0245784 0.0483443 -0.0458068 0.0564566 0.1183382 0.02605 -0.0346949 0.087885 -0.0115875 0.1138122 0.0631869 0.0529315 0.0452494 0.0252395 0.0918062 0.0328553 -0.0578176 -0.0081792 0.1075558 0.0730178 -0.0606582 0.0296631 0.0633432 0.0389747 0.0282217 -0.0130908 0.0762576 0.0215619 0.0678863 -0.0527963 0.0678022 0.1200878 0.0449397 0.0307439 -0.0470825 0.0533446 0.1271542 0.0675589 -0.0390461 0.0714555 0.0386073 0.0351968 -0.022848 0.0599038 -0.0370767 0.1304538 0.0628313 0.0539466 0.0628964 0.0434691 -0.0688247 0.0312948 -0.0095508 0.0034649 0.0981969 0.0304322 0.0107477 0.0287872 0.1423522 unknown
polarizability: 273.381488|16.5348793|112.7729958|-15.9026022|-42.3378556|97.0997648 unknown
InChI: InChI=1S/C12H7ClO2/c13-9-3-1-8(2-4-9)11-7-10(14)5-6-12(11)15/h1-7H
charge 0 multiplicity 1
22 atoms
Cl -5.333342 0.369951 -0.0140
O  0.881101 -2.222091 1.092701
O  3.688664 1.900624 -1.116647
C  0.782024 -0.033655 0.006853
C  -0.70048 0.022879 0.006985
C  1.501424 -1.225898 0.601695
C  1.547018 0.977043 -0.541215
C  -1.383072 0.6737 -1.061925
C  -1.478007 -0.531072 1.064883
C  3.023258 0.948608 -0.587425
C  2.990073 -1.233137 0.582118
C  -2.786577 0.782954 -1.077866
C  -2.88359 -0.422475 1.065379
C  3.713467 -0.222926 0.017839
C  -3.519565 0.234469 -0.005737
H  1.086764 1.883435 -0.950661
H  -0.81463 1.069342 -1.910424
H  -0.9849 -1.045767 1.89149
H  3.457953 -2.113366 1.036742
H  -3.300693 1.272097 -1.909872
H  -3.472101 -0.842604 1.885673
H  4.808513 -0.222112 -0.016587
