program: Gaussian 09
title: 000244144
version: EM64L-G09RevD.01
frameworkgroup: C1[X(C10H13N3O2)]
method: RPBEPBE
basis: SDD
operation: Freq
keyword: #p
keyword: freq=noraman
keyword: PBEPBE/SDD
title: #p freq=noraman PBEPBE/SDD
converged: YES YES NO NO
title: Mulliken charges:
elementType: O O N N N C C C C C C C C C C H H H H H H H H H H H H H
charge: -0.292400 -0.295731 -0.397738 -0.621349 -0.350033 0.468757 -0.477935 -0.387898 -0.364686 -0.417142 -0.225488 -0.228064 -0.232343 0.317633 0.128675 0.220347 0.244385 0.232031 0.272540 0.258301 0.273207 0.227311 0.229046 0.329377 0.229967 0.317225 0.331683 0.210322
chargesum: 0.00000
title: Mulliken charges with hydrogens summed into heavy atoms:
elementType: O O N N N C C C C C C C C C C
charge: -0.292400 -0.295731 -0.068361 0.027560 -0.139711 0.468757 -0.013203 -0.155867 -0.092146 0.114365 0.001824 0.000982 -0.002376 0.317633 0.128675
polarizability: 1.76396424e+02 3.37994223e+00 1.24372655e+02 8.40965437e+00 -5.56777734e+00 1.00102385e+02
1716.lowfreq: -15.5433 -2.3695 -0.0008 -0.0004 0.0005 8.4482 17.5549 25.6567 34.6288
frequency: 17.0136 25.5260 34.2252 45.6652 61.7228 87.8638 152.0497 181.1737 251.3079 279.8872 287.5484 345.6888 396.1220 403.8004 432.0954 438.2937 476.3882 492.6677 522.4947 587.5084 614.6760 617.7535 637.2583 654.7393 697.9184 705.4745 758.2733 815.6803 826.7615 836.0531 858.8387 870.5882 922.0499 939.3029 975.0794 982.7730 990.2499 1001.2987 1020.7566 1026.5409 1052.6106 1080.2583 1091.0497 1110.7507 1173.3246 1189.2636 1194.9875 1222.0413 1239.2166 1241.7507 1331.5404 1333.3289 1350.1959 1379.2175 1385.2107 1442.0259 1456.2366 1462.3290 1483.4914 1487.4400 1594.1926 1604.1476 1614.1755 1645.4683 1660.4955 3024.0710 3035.4830 3090.7487 3109.6148 3119.0810 3128.0122 3139.8992 3150.8060 3164.8751 3320.3337 3525.3372 3560.9585 3675.1434
redmass: 4.6304 4.6817 4.5756 4.7838 5.3975 6.4206 5.8031 3.7377 5.1425 5.7771 4.6681 2.8328 2.7380 2.8193 1.3569 1.1861 3.2773 1.6690 2.8823 4.0446 3.0671 3.5036 3.6406 1.7185 7.1069 1.9625 2.1402 3.5398 1.9420 2.2729 1.2491 3.0991 2.9116 1.8419 1.8206 1.4169 5.2136 1.3438 2.0712 2.2196 1.6938 1.7636 1.5231 3.7211 1.0542 1.1738 1.8788 2.8358 1.1633 1.2416 1.2562 1.2814 1.2548 3.3727 7.9918 2.1703 1.0876 1.1360 2.1998 1.8970 6.0404 1.3078 6.0081 4.3744 7.0504 1.0596 1.0586 1.1034 1.1072 1.0868 1.0873 1.0920 1.0964 1.1016 1.0761 1.0448 1.0771 1.1037
irintensity: 4.0360 1.8715 0.4952 3.4517 5.0926 6.2607 2.2650 4.0055 0.5711 5.1304 15.0949 1.4865 36.0870 0.1340 10.4686 251.0655 29.6663 26.8263 2.2314 11.1320 30.5517 19.9220 16.5743 70.2263 28.5599 59.2719 65.5618 9.3515 64.4994 16.4724 0.3711 27.4708 153.5775 30.4956 21.9645 1.6316 0.0571 0.5763 10.1056 3.9958 101.6293 16.4060 7.3653 188.5117 0.0320 35.9515 199.5551 27.7826 14.3021 121.2952 1.7942 12.1019 7.1546 82.9560 0.7274 9.9840 33.1873 9.2929 32.5610 316.3102 2.4192 92.9747 0.4129 188.4160 292.8430 13.9471 33.3813 4.7129 5.8894 6.2492 1.8652 18.5923 25.4608 22.2488 29.8299 24.3462 37.0829 31.8149
temp: 298.150 k
press: 1.00000 atm
elementType: 8 8 7 7 7 6 6 6 6 6 6 6 6 6 6 1 1 1 1 1 1 1 1 1 1 1 1 1
symmnumber: 1
zpe: 587008.9 jmol-1
zpe.correction: 0.223580 hartree
zpe.thermalcorrener: 0.238306 hartree
zpe.thermalcorrenthalpy: 0.239250 hartree
zpe.thermalcorrgfe: 0.178336 hartree
zpe.sumelectzpe: -702.460170 hartree
zpe.sumelectthermal: -702.445444 hartree
zpe.sumelectthermalent: -702.444499 hartree
zpe.sumelectthermalfe: -702.505414 hartree
dipole: -0.6330 3.4552 -0.5618
dipole: 3.5574
quadrupole: -77.3390 -84.8711 -91.3176
quadrupole: 17.3532 7.0928 -1.5695
quadrupole: 7.1703 -0.3619 -6.8084 17.3532 7.0928 -1.5695
hfenergy: -702.6837498 hartree
pointgroup: C01 [X(C10H13N3O2)]
dipole: 0.2002988 -0.8444327 -1.0980098 debye
polarizability: 177.2895135|-2.9338813|106.0140846|2.1564486|12.4851801|117.5678654 unknown
InChI: InChI=1S/C10H13N3O2/c11-9(12)6-13-10(14)15-7-8-4-2-1-3-5-8/h1-5,11,13H,6-7,12H2
charge 0 multiplicity 1
28 atoms
O  -0.115332 -0.589433 -1.120651
O  -1.027192 -0.645713 1.061357
N  -1.898351 0.731316 -0.637436
N  -4.619152 -0.053471 -0.793505
N  -5.169407 2.227938 -0.134408
C  2.189415 -0.802613 -0.184097
C  0.964621 -1.539829 -0.680361
C  3.254639 -0.500459 -1.069959
C  2.286408 -0.406127 1.175549
C  -2.901983 1.412728 0.190022
C  4.397706 0.190802 -0.609868
C  3.428148 0.285822 1.636023
C  4.486266 0.585308 0.745499
C  -1.017619 -0.194778 -0.114677
C  -4.345722 1.214886 -0.287595
H  1.173161 -2.11461 -1.596406
H  0.537539 -2.193621 0.099556
H  3.186804 -0.805692 -2.121664
H  1.458891 -0.632751 1.857319
H  -2.724494 2.500001 0.231127
H  -2.799587 1.008921 1.213401
H  5.216133 0.418113 -1.302085
H  3.494882 0.588474 2.68698
H  -1.72414 1.05509 -1.590366
H  5.37295 1.119724 1.104961
H  -5.556478 -0.31044 -1.094814
H  -3.869771 -0.738854 -0.878122
H  -6.151232 2.015767 -0.410877
