program: Gaussian 09
title: 000244135
version: EM64L-G09RevD.01
frameworkgroup: C1[X(C10H11NO)]
method: RPBEPBE
basis: SDD
operation: Freq
keyword: #p
keyword: freq=noraman
keyword: PBEPBE/SDD
title: #p freq=noraman PBEPBE/SDD
converged: YES YES NO NO
title: Mulliken charges:
elementType: O N C C C C C C C C C C H H H H H H H H H H H
charge: -0.299254 -0.108979 -0.027357 -0.511532 0.106288 -0.692485 0.304694 -0.360667 -0.350630 -0.220569 -0.222418 -0.230115 0.234596 0.233792 0.232671 0.238160 0.232183 0.214755 0.273063 0.266761 0.229481 0.228147 0.229418
chargesum: 0.00000
title: Mulliken charges with hydrogens summed into heavy atoms:
elementType: O N C C C C C C C C C C
charge: -0.299254 -0.108979 0.207238 -0.045069 0.106288 -0.007387 0.304694 -0.087604 -0.083870 0.008912 0.005728 -0.000697
polarizability: 1.72962549e+02 -7.96399809e+00 1.15361012e+02 4.50594753e+00 4.86241004e+00 6.18189636e+01
1716.lowfreq: -18.2605 -9.0933 -0.0009 -0.0007 -0.0006 3.5530 40.4469 66.6381 105.9543
frequency: 40.3353 66.6189 105.9499 132.7721 218.4596 238.2625 307.5724 339.6888 403.8964 411.8345 444.4148 470.1328 614.0683 647.8590 670.3644 699.0202 702.8773 782.2578 792.6658 844.8743 863.7344 874.6323 915.2112 946.6608 954.7420 989.9250 992.7167 1002.4797 1004.5753 1032.1966 1042.1934 1083.5895 1091.9261 1118.5758 1172.7551 1183.5977 1200.4489 1250.9061 1272.0972 1312.1072 1320.0901 1341.4300 1386.4904 1390.2761 1437.4711 1460.1330 1464.4460 1475.0128 1481.0863 1582.8371 1604.9962 1622.4239 2986.6850 2999.5863 3038.9285 3056.4323 3083.8710 3099.8551 3127.5740 3140.3498 3154.6747 3166.6024 3174.5607
redmass: 3.1545 4.5232 3.7942 4.0557 1.2901 2.3269 4.1664 2.9791 2.8437 2.9371 4.4523 3.7959 6.4289 4.8354 5.8447 1.8712 4.0837 1.8660 4.4619 7.3801 1.2455 3.1320 1.3687 1.4193 5.3276 6.2011 1.3798 6.3653 1.3223 2.0716 1.9653 1.5980 1.6061 1.7485 1.0560 1.1120 1.3374 2.1271 1.3223 1.4274 1.4788 1.5883 9.3338 1.2351 2.2520 1.0487 1.1091 1.1176 2.0912 6.5158 7.4353 6.8927 1.0363 1.0594 1.0935 1.1009 1.0983 1.1006 1.0852 1.0893 1.0941 1.0962 1.0993
irintensity: 0.3490 0.4765 4.2558 2.2293 0.9143 2.0941 2.4329 0.8290 0.0176 1.9000 5.0900 0.9879 0.2562 27.6433 6.2048 51.7975 4.6423 46.3018 24.3534 28.2996 0.0017 1.0853 2.6731 5.8671 55.5982 1.7048 0.0036 117.2046 0.7129 19.7279 14.7239 5.0214 1.1677 2.6275 0.0174 9.5012 4.4007 53.7282 6.0388 24.5244 39.5357 5.9381 0.8308 23.9487 16.6587 9.9512 5.4693 15.0721 15.9660 30.9299 35.8646 37.4938 16.0216 51.6893 13.1818 32.3321 33.9766 31.0220 0.0483 14.9178 23.0941 14.7505 10.8877
temp: 298.150 k
press: 1.00000 atm
elementType: 8 7 6 6 6 6 6 6 6 6 6 6 1 1 1 1 1 1 1 1 1 1 1
symmnumber: 1
zpe: 489480.9 jmol-1
zpe.correction: 0.186433 hartree
zpe.thermalcorrener: 0.196839 hartree
zpe.thermalcorrenthalpy: 0.197783 hartree
zpe.thermalcorrgfe: 0.149550 hartree
zpe.sumelectzpe: -516.758670 hartree
zpe.sumelectthermal: -516.748265 hartree
zpe.sumelectthermalent: -516.747320 hartree
zpe.sumelectthermalfe: -516.795554 hartree
dipole: -1.2379 -0.9392 -0.0069
dipole: 1.5539
quadrupole: -52.3008 -70.5659 -73.1637
quadrupole: 0.1439 1.4030 0.2136
quadrupole: 13.0426 -5.2224 -7.8202 0.1439 1.4030 0.2136
hfenergy: -516.9451035 hartree
pointgroup: C01 [X(C10H11N1O1)]
dipole: -0.476682 -0.3819539 0.0251718 debye
dipolederiv: -1.1549645 -0.409829 0.0475104 -0.2500812 -0.7701345 -0.0199427 -0.0106739 -0.070109 -0.2702769 -0.6758471 0.1505516 0.009203 0.1401163 -0.6602524 0.021123 0.0211595 -0.0247806 -0.3360047 0.6825532 0.2322577 -0.0677032 0.0133684 0.113523 -0.02021 -0.08811 -0.0397582 0.3942681 0.2380005 -0.1128398 0.0087378 -0.0260084 0.09212 -0.016675 -0.0079398 0.0012286 0.238687 1.2902102 0.1146886 0.0436937 0.3203247 0.9762172 0.0287896 0.1114107 0.1032613 0.0941807 -0.0485221 -0.0651606 0.0656172 -0.0563363 0.0241117 0.0733332 0.0883637 0.0668054 -0.0905799 -0.187773 -0.0386449 -0.0081317 -0.0712525 -0.0211879 0.0001786 -0.0263945 -0.0082325 0.0184995 -0.0390654 -0.0806683 0.0004967 0.0482216 0.0170777 0.0128477 0.009071 0.0088647 -0.1207658 0.0393689 0.0850019 0.0199391 -0.0297678 -0.01762 0.0107592 0.0126033 0.0169809 -0.1319545 -0.031722 0.1416961 0.0237125 0.1555343 0.0422287 0.0278869 0.0229626 0.0278252 -0.1531721 -0.1243857 -0.1126803 -0.007493 -0.1624401 0.1036286 0.0174676 -0.0150483 0.0183642 -0.1567979 0.0755395 -0.0082017 0.0150568 0.0110046 -0.0134338 0.0146295 0.0144429 0.012952 -0.1504767 -0.0476822 -0.0550731 -0.0429337 -0.0497348 0.0400832 -0.0515277 -0.0862975 -0.0511385 -0.1138877 -0.0451194 0.0656757 -0.0545758 -0.0222966 0.0340942 0.0785535 -0.1364266 0.1149713 -0.066389 -0.0747947 0.0694538 0.0665492 0.0012453 0.0743469 -0.0487734 0.1475718 -0.0821436 -0.0343164 0.1147357 0.0355935 0.0061365 -0.028323 -0.1331058 0.0206031 0.0345515 -0.0089592 0.081637 0.0603516 -0.0353697 -0.0938666 -0.0405469 0.0486883 -0.0790608 -0.0558912 -0.0388256 -0.0642201 -0.1579524 0.0231518 0.0132289 0.0716782 0.0800091 0.0088318 0.0103849 0.0303309 0.0863898 0.114158 0.0700186 0.0018072 0.0473634 0.0003719 -0.0127767 0.0015008 -0.0103733 0.153138 0.0857901 -0.0769648 -0.0155221 -0.0835308 0.0145413 -0.0156625 -0.0129587 -0.0173969 0.1548331 -0.0071803 -0.0923903 -0.0176558 -0.1128135 -0.0462098 -0.0260092 -0.0210796 -0.0253704 0.1534127 0.0324115 0.0751335 0.0008782 0.0990952 -0.0893002 -0.0190027 0.0020971 -0.0192568 0.1553203 -0.1381103 0.0245996 -0.0146855 0.02518 0.0902027 -0.0053631 -0.0152997 -0.00524 0.1584757 unknown
polarizability: 173.4879329|-6.1629227|115.3321849|2.3866247|2.5657212|61.3224065 unknown
InChI: InChI=1S/C10H11NO/c1-8-7-11-10(12-8)9-5-3-2-4-6-9/h2-6,8H,7H2,1H3
charge 0 multiplicity 1
23 atoms
O  -1.446818 -0.910976 -0.30231
N  -1.337081 1.405664 -0.052212
C  -2.895794 -0.476267 -0.255521
C  -2.791098 1.0878 -0.205735
C  -0.683065 0.272932 -0.125273
C  -3.561034 -1.113337 0.965811
C  0.778465 0.096632 -0.050826
C  1.609953 1.237218 0.110438
C  1.360379 -1.194785 -0.140571
C  3.008729 1.083731 0.181551
C  2.76269 -1.341287 -0.069894
C  3.589592 -0.205245 0.091368
H  -3.34578 -0.84281 -1.194076
H  -3.168404 1.564644 -1.128802
H  -3.354147 1.507979 0.6477
H  -3.462505 -2.212069 0.940383
H  -3.10014 -0.742681 1.898547
H  -4.638298 -0.862489 0.985069
H  1.139541 2.223379 0.176688
H  0.709984 -2.065569 -0.265001
H  3.647949 1.964663 0.306301
H  3.20988 -2.338931 -0.140394
H  4.677901 -0.321496 0.146059
