program: Gaussian 09
title: 000244133
version: EM64L-G09RevD.01
frameworkgroup: C1[X(C10H10N2O3)]
method: RPBEPBE
basis: SDD
operation: Freq
keyword: #p
keyword: freq=noraman
keyword: PBEPBE/SDD
title: #p freq=noraman PBEPBE/SDD
converged: YES YES NO NO
title: Mulliken charges:
elementType: O O O N N C C C C C C C C C C H H H H H H H H H H
charge: -0.298783 -0.206606 -0.197407 -0.097811 0.021598 -0.027878 -0.511514 0.108891 -0.689896 0.345777 -0.479328 -0.356089 0.384162 -0.183690 -0.358937 0.239916 0.241288 0.239693 0.239745 0.232312 0.219369 0.325429 0.278372 0.241897 0.289491
chargesum: 0.00000
title: Mulliken charges with hydrogens summed into heavy atoms:
elementType: O O O N N C C C C C C C C C C
charge: -0.298783 -0.206606 -0.197407 -0.097811 0.021598 0.212038 -0.030533 0.108891 0.001531 0.345777 -0.153899 -0.077718 0.384162 0.058207 -0.069446
polarizability: 2.03047819e+02 -9.80712798e+00 1.45403758e+02 -3.99827757e+00 -1.66273023e-01 6.60873971e+01
1716.lowfreq: -12.4607 -4.7185 -3.9875 -0.0008 -0.0003 0.0006 28.1397 48.0768 66.9349
frequency: 27.8565 48.0534 66.9175 93.9394 105.1749 173.0575 207.2775 221.5535 250.6559 287.8881 337.1301 380.0401 415.3945 427.3423 450.0130 487.2820 525.3205 638.7082 646.2108 688.1009 692.1898 703.4242 717.8079 785.5926 804.2528 826.5334 863.0611 874.9620 914.7301 954.9902 957.8404 973.4783 989.1580 1008.7579 1028.1410 1055.2355 1083.2657 1088.1185 1092.0291 1118.7007 1175.5622 1199.6846 1216.6762 1249.3268 1272.4442 1280.9357 1314.8483 1339.3361 1375.0219 1392.0819 1398.6730 1434.8705 1460.0022 1463.9012 1473.6660 1477.5218 1583.8612 1605.1735 1625.6564 2988.0398 3006.0748 3045.0575 3063.2927 3085.7130 3101.1268 3154.1760 3177.2671 3184.8423 3189.2038
redmass: 3.6574 9.9124 5.2812 6.3704 3.7501 5.0721 3.3508 1.4027 2.8842 7.1410 2.5188 7.6067 2.8140 3.3553 6.4696 5.4492 6.0088 7.1423 7.3184 4.4740 2.4028 5.7430 8.0878 5.0441 8.0479 1.4698 6.6323 3.2506 1.3659 5.2764 1.4132 1.4294 6.2736 1.3574 2.4287 2.5932 1.9734 1.7988 1.6133 1.7559 1.1360 1.3385 8.2053 2.1689 1.3137 1.3360 1.6308 1.5735 11.9381 1.2344 8.1313 2.8473 1.0505 1.1333 1.3401 1.7864 7.2131 8.0634 7.6362 1.0362 1.0597 1.0928 1.1019 1.0984 1.1006 1.0884 1.0935 1.0929 1.0977
irintensity: 0.0596 0.0251 0.7435 0.4692 2.1285 3.3162 3.6577 0.6548 3.4801 1.4585 1.5960 0.6622 1.7908 0.2984 6.8697 0.5933 0.8116 8.8851 3.4672 21.4386 47.0216 15.1747 1.0019 36.0922 8.8469 36.5577 36.5426 1.0921 2.2891 53.9858 1.8803 18.5173 0.2187 0.9170 88.1820 21.5121 62.8156 21.9621 1.3042 2.6388 24.2165 5.2343 305.7048 9.2338 6.3510 3.7249 34.5331 0.9081 111.9427 24.2874 1.3164 13.5168 10.1029 4.7211 36.7389 21.6902 18.2683 40.3209 15.8212 14.4755 38.1944 11.5199 24.2358 31.8919 29.6436 8.9120 1.0983 6.4611 6.4484
temp: 298.150 k
press: 1.00000 atm
elementType: 8 8 8 7 7 6 6 6 6 6 6 6 6 6 6 1 1 1 1 1 1 1 1 1 1
symmnumber: 1
zpe: 492527.8 jmol-1
zpe.correction: 0.187594 hartree
zpe.thermalcorrener: 0.200675 hartree
zpe.thermalcorrenthalpy: 0.201619 hartree
zpe.thermalcorrgfe: 0.146290 hartree
zpe.sumelectzpe: -721.060226 hartree
zpe.sumelectthermal: -721.047145 hartree
zpe.sumelectthermalent: -721.046201 hartree
zpe.sumelectthermalfe: -721.101530 hartree
dipole: 6.1846 3.3972 -0.2191
dipole: 7.0596
quadrupole: -87.5120 -86.9367 -86.4783
quadrupole: -13.0928 0.7796 0.6734
quadrupole: -0.5363 0.0390 0.4974 -13.0928 0.7796 0.6734
hfenergy: -721.2478203 hartree
pointgroup: C01 [X(C10H10N2O3)]
dipole: -2.4207931 -1.3596908 0.0726309 debye
dipolederiv: -1.3237757 -0.2840778 0.1259376 -0.0765081 -0.6179706 0.0120021 0.040871 -0.010831 -0.2679885 -0.9369513 0.0755103 -0.0190996 -0.0181074 -0.4758014 0.0078449 -0.0213726 0.0096898 -0.2296785 -0.5381851 -0.0683802 -0.0052688 -0.107598 -0.7996108 0.0170873 -0.0065889 0.0152091 -0.220096 -0.5651954 0.0862384 0.0166685 0.0468878 -0.6367994 0.0497407 0.0144496 0.005302 -0.3256296 1.581002 0.2206591 0.0286817 0.4060701 1.2210747 -0.0243452 0.030657 -0.0240397 0.1878589 0.7318399 0.0707046 -0.0962008 -0.1686711 0.0893148 0.0408217 -0.0997363 0.0135368 0.398743 0.1606728 -0.1148342 0.0197155 -0.0409673 0.129604 -0.004063 -0.0014647 0.0237614 0.227042 1.2785498 0.1326268 -0.0253319 0.3251734 0.7680175 -0.0768303 0.0339112 -0.0112773 0.0874084 -0.0765344 -0.0283372 0.0840222 -0.0115925 0.0605213 0.0364991 0.1043009 0.0248988 -0.1049033 -0.0434678 -0.1452801 0.0099273 -0.1829203 -0.1082087 0.0057636 -0.0042136 -0.00028 0.022174 0.0700311 0.1830885 0.0007075 -0.0039639 -0.0576198 -0.0038695 0.0044616 0.0051198 -0.0741307 0.1070607 0.0558187 0.0058304 -0.0076352 0.0226767 -0.0036661 0.0117987 -0.0026619 -0.1032467 -0.3648603 -0.230451 -0.0020727 -0.2816465 -0.1687649 -0.0001406 -0.0045805 -0.0006234 0.0564073 -0.3306127 -0.0714237 -0.0008635 -0.1196125 0.2054847 -0.0125417 -0.0036587 -0.0127652 -0.1380277 -0.0263833 -0.0204745 0.0056472 0.2918836 0.019549 0.0025817 -0.0068205 -0.0043889 -0.1055146 -0.071289 -0.0336371 -0.0488018 -0.0285407 0.0554302 -0.0539284 -0.0903396 -0.0415556 -0.0916034 -0.02836 0.0756666 -0.0388449 -0.0194974 0.0506412 0.0752732 -0.0933587 0.1189815 -0.0684828 -0.0302034 0.0890215 0.0373585 0.0305544 0.0383694 -0.0703894 0.1109996 -0.1222274 -0.0160517 0.1055093 -0.0257346 0.0130159 -0.0877646 -0.1103021 0.0412564 0.0397299 0.0020865 0.0770884 0.0323424 -0.0451128 -0.1119074 -0.0501141 0.0605593 -0.0590661 -0.0654523 -0.0323583 -0.0428501 -0.1036482 0.0768216 0.0143549 0.1265183 0.0441488 0.0043898 0.0143808 0.0290017 0.0834541 0.1886916 0.0044417 -0.0024808 0.0173523 0.091577 0.0023197 -0.0002459 0.00276 0.1662409 0.0633897 -0.0752065 -0.0033247 -0.0882926 0.0807631 0.0038845 -0.0001853 0.00143 0.1551551 0.0671561 0.0232469 -0.0025266 0.030452 -0.0902533 0.0073933 -0.0035673 0.0083665 0.1535165 0.0532213 0.0491051 -0.0051437 0.0185404 0.1275991 0.0019822 -0.0039753 0.0028647 0.173115 unknown
polarizability: 203.3576046|-9.219212|145.0130615|-0.1328266|-3.9515573|66.1683079 unknown
InChI: InChI=1S/C10H10N2O3/c1-7-6-11-10(15-7)8-3-2-4-9(5-8)12(13)14/h2-5,7H,6H2,1H3
charge 0 multiplicity 1
25 atoms
O  -2.564203 -0.789677 -0.172312
O  4.600872 0.351968 0.023744
O  3.189919 2.140047 -0.073659
N  -1.830607 1.424799 -0.205136
N  3.419694 0.871874 -0.028596
C  -3.844463 0.02406 -0.146327
C  -3.32388 1.498736 -0.278058
C  -1.511596 0.157354 -0.158858
C  -4.592325 -0.278698 1.152343
C  -0.14532 -0.395507 -0.09993
C  0.958718 0.491199 -0.093888
C  0.069926 -1.797899 -0.050352
C  2.254604 -0.052608 -0.036992
C  1.38389 -2.314167 0.004825
C  2.49345 -1.445407 0.012561
H  -4.419557 -0.304494 -1.028523
H  -3.612922 1.965132 -1.23698
H  -3.700582 2.140588 0.53873
H  -4.796593 -1.35865 1.248948
H  -4.003106 0.04644 2.028112
H  -5.559221 0.258183 1.164378
H  0.802041 1.572353 -0.132525
H  -0.795305 -2.466849 -0.056199
H  1.542639 -3.396356 0.042204
H  3.521625 -1.813723 0.054988
