program: Gaussian 09
title: 000244154
version: EM64L-G09RevD.01
frameworkgroup: C1[X(C19H20N2O2)]
method: RPBEPBE
basis: SDD
operation: Freq
keyword: #p
keyword: freq=noraman
keyword: PBEPBE/SDD
title: #p freq=noraman PBEPBE/SDD
converged: YES YES NO NO
title: Mulliken charges:
elementType: O O N N C C C C C C C C C C C C C C C C C C C H H H H H H H H H H H H H H H H H H H H
charge: -0.270947 -0.273908 -0.233393 -0.605779 0.117711 0.192129 0.226121 0.181292 -0.556251 -0.639940 -0.576529 -0.327405 -0.793881 0.460279 0.315536 -0.370201 0.187820 -0.413011 -0.380310 -0.219824 -0.227504 -0.241486 -0.536587 0.239571 0.233646 0.243408 0.252305 0.258832 0.235570 0.256533 0.243609 0.232000 0.248103 0.228755 0.264904 0.228441 0.230688 0.231470 0.352025 0.323479 0.242472 0.219936 0.220319
chargesum: 0.00000
title: Mulliken charges with hydrogens summed into heavy atoms:
elementType: O O N N C C C C C C C C C C C C C C C C C C C
charge: -0.270947 -0.273908 -0.233393 0.069726 0.117711 0.192129 0.226121 0.181292 -0.083034 -0.144227 -0.317697 -0.091835 -0.061739 0.460279 0.315536 -0.122098 0.187820 -0.184256 -0.115406 0.008617 0.003184 -0.010016 0.146141
polarizability: 2.93517271e+02 -2.35859957e+01 2.20706480e+02 1.50525299e+01 1.52001010e+00 1.70610849e+02
1716.lowfreq: -8.4602 -5.6571 -4.2376 0.0003 0.0006 0.0007 14.7541 26.7576 28.5064
frequency: 14.4626 26.6378 28.4981 29.5321 34.7418 63.1974 84.6543 108.2945 128.5294 140.1523 150.1676 175.0646 194.6368 218.2132 232.2766 259.3859 273.3069 291.8296 304.0361 346.3022 381.5577 399.8179 401.9802 413.6132 433.3597 454.2837 472.0015 492.8810 517.8371 547.4481 565.9705 571.2158 583.4494 611.1113 617.4155 645.3550 657.5649 666.9731 701.9701 715.7381 720.6318 742.1171 754.2276 792.1783 801.0019 829.6241 836.1202 847.2436 855.5728 879.5236 906.2786 932.0208 935.5624 978.7707 989.2492 989.5760 998.0936 1009.9484 1016.9168 1027.4318 1041.5641 1059.6374 1063.8482 1086.7052 1113.1059 1134.6605 1147.7402 1160.0508 1173.5849 1190.4482 1194.3794 1198.3609 1214.0824 1230.4941 1262.1973 1279.7155 1302.1026 1314.4915 1339.5719 1345.8084 1367.9875 1388.5639 1398.4716 1410.1137 1421.2477 1432.1225 1441.5370 1446.6349 1461.9068 1464.9114 1465.7875 1468.2483 1473.2906 1477.5165 1482.1452 1487.1039 1567.0749 1576.8638 1589.0015 1595.7467 1615.0237 1626.5328 1639.3059 2953.4833 2969.0326 2992.2380 2994.2102 3038.1330 3038.7649 3040.5773 3049.0227 3099.0924 3111.4463 3121.1197 3127.8596 3135.9370 3139.0482 3149.9938 3156.2187 3165.3314 3171.3652 3504.9575 3663.7446
redmass: 4.7264 7.0526 4.1850 5.4428 4.3315 3.7455 4.4270 3.1897 1.0587 4.2924 3.5189 3.6980 2.8100 3.6715 2.0309 2.1465 2.1794 2.7943 3.0478 4.5001 5.8160 5.8425 2.8884 5.2458 2.8603 2.8079 2.7805 2.1525 2.9815 5.0279 1.2354 4.3897 3.0268 4.2266 4.9088 4.5136 1.5751 5.0473 2.5551 4.6282 2.6283 1.8951 3.8021 3.9223 1.5424 3.0745 2.9780 1.9748 1.2507 3.1898 1.4401 1.3469 1.8149 1.3886 4.1898 6.0440 1.4027 3.2342 2.2955 2.2155 1.4725 1.8568 2.1196 1.6046 1.2625 1.2965 1.8841 1.6311 1.0534 1.1152 1.4908 2.7850 2.2089 2.0229 1.3634 1.7311 1.5233 2.0836 2.8825 1.4519 4.1328 4.4661 1.4398 3.8680 3.6358 1.3972 2.0966 1.1425 1.1123 1.0504 1.0685 1.9303 2.1970 1.3624 1.8869 1.6425 1.6849 3.6204 7.3237 6.0744 5.9052 7.2061 4.5269 1.0333 1.0405 1.0595 1.0628 1.1036 1.1015 1.0963 1.0969 1.0956 1.0880 1.0989 1.0860 1.0892 1.0911 1.0958 1.0910 1.1015 1.0952 1.0445 1.1042
irintensity: 0.0587 5.6201 0.4673 0.5451 3.7650 5.2731 0.4649 0.1447 0.1075 2.1722 1.2120 3.7126 2.1818 3.8971 3.5907 2.5894 0.7285 7.8217 10.7011 5.3484 0.5791 2.8676 0.3477 0.5906 5.4511 7.6048 1.9999 14.4433 9.6407 6.9135 159.1131 8.1021 7.7990 3.3665 1.3631 20.1937 35.2992 2.3871 13.8366 30.6892 22.6460 31.0802 2.8899 3.5521 41.1919 10.9112 8.9819 23.0931 0.3288 34.3824 0.5321 0.3875 2.7373 0.3151 39.9057 1.7273 3.8805 10.3476 8.0248 7.6323 2.9103 8.6159 6.6669 3.9579 0.1226 4.3777 52.4895 34.7633 0.1684 3.6504 19.5164 17.8016 105.9315 11.7295 16.8182 32.2487 30.8598 10.1569 94.1540 19.2805 39.1024 4.8184 6.7637 79.8203 29.2857 27.1012 19.4273 7.8307 22.2111 14.1190 13.3154 58.6005 102.9464 28.5750 24.5268 35.9686 118.0883 38.7820 27.9715 1.6047 7.1738 42.3611 344.0280 63.4413 37.5492 32.9277 18.4250 48.9722 9.6992 12.8314 6.6997 15.2823 9.8763 31.4251 0.4493 13.3731 13.8116 31.4371 8.1954 23.7616 6.7633 27.5186 61.2919
temp: 298.150 k
press: 1.00000 atm
elementType: 8 8 7 7 6 6 6 6 6 6 6 6 6 6 6 6 6 6 6 6 6 6 6 1 1 1 1 1 1 1 1 1 1 1 1 1 1 1 1 1 1 1 1
symmnumber: 1
zpe: 912564.2 jmol-1
zpe.correction: 0.347577 hartree
zpe.thermalcorrener: 0.369238 hartree
zpe.thermalcorrenthalpy: 0.370182 hartree
zpe.thermalcorrgfe: 0.293778 hartree
zpe.sumelectzpe: -994.344486 hartree
zpe.sumelectthermal: -994.322825 hartree
zpe.sumelectthermalent: -994.321881 hartree
zpe.sumelectthermalfe: -994.398285 hartree
dipole: -3.9155 -1.1947 -2.3401
dipole: 4.7154
quadrupole: -126.3998 -153.7669 -126.7500
quadrupole: -16.4978 -2.2864 -10.9947
quadrupole: 9.2391 -18.1280 8.8889 -16.4978 -2.2864 -10.9947
hfenergy: -994.6920629 hartree
pointgroup: C01 [X(C19H20N2O2)]
dipole: 1.4962339 0.196969 -1.0789474 debye
polarizability: 286.2366518|-32.0954292|224.4434033|-19.8913785|-5.2221856|174.1545453 unknown
InChI: InChI=1S/C19H20N2O2/c1-13-16(11-19(20)22)17-10-15(23-2)8-9-18(17)21(13)12-14-6-4-3-5-7-14/h3-10H,11-12,20H2,1-2H3
charge 0 multiplicity 1
43 atoms
O  -3.360884 3.426451 0.035652
O  -4.144518 -3.247316 1.666772
N  0.567723 -0.493483 -0.692093
N  -3.531738 -2.357881 -0.391297
C  -1.171104 -1.148222 0.654891
C  0.047966 -1.552049 0.083714
C  -0.311486 0.603344 -0.613227
C  -1.4132 0.217135 0.220726
C  1.841637 -0.510492 -1.417171
C  -2.056782 -1.95292 1.56889
C  -2.470537 1.136175 0.469661
C  -0.236619 1.889116 -1.196152
C  0.771946 -2.863297 0.191212
C  3.082829 -0.306939 -0.541334
C  -2.391415 2.41478 -0.11958
C  -1.285303 2.788773 -0.943853
C  -3.336377 -2.576574 0.957736
C  4.332935 -0.813812 -0.975694
C  3.015005 0.406464 0.680139
C  5.500314 -0.603501 -0.208143
C  4.181499 0.614168 1.450856
C  5.4277 0.11275 1.009222
C  -4.523252 3.113246 0.86571
H  1.794049 0.284809 -2.184809
H  1.935589 -1.465078 -1.968663
H  -1.506793 -2.794208 2.028585
H  -2.407907 -1.336197 2.418948
H  -3.314665 0.843196 1.100739
H  0.609022 2.197244 -1.820315
H  1.806589 -2.733633 0.56064
H  0.244428 -3.533803 0.888337
H  0.832106 -3.386985 -0.783407
H  -1.280346 3.797375 -1.367374
H  4.395161 -1.37773 -1.915673
H  2.050623 0.791927 1.028932
H  6.46056 -1.002262 -0.554163
H  4.116834 1.166783 2.394856
H  6.330737 0.27373 1.608366
H  -2.875364 -1.78906 -0.926394
H  -4.362841 -2.744655 -0.836811
H  -5.143521 4.02168 0.851456
H  -4.225722 2.881219 1.907629
H  -5.098574 2.261934 0.450686
