program: Gaussian 09
title: 000244109
version: EM64L-G09RevD.01
frameworkgroup: C1[X(C13H9ClS)]
method: RPBEPBE
basis: SDD
operation: Freq
keyword: #p
keyword: freq=noraman
keyword: PBEPBE/SDD
title: #p freq=noraman PBEPBE/SDD
converged: YES YES NO NO
title: Mulliken charges:
elementType: Cl S C C C C C C C C C C C C C H H H H H H H H H
charge: -0.062891 0.205816 -0.714823 0.600776 0.557034 -0.351088 -0.319344 -0.411058 -0.424269 -0.245197 -0.266683 -0.090541 -0.230402 -0.232782 -0.234629 0.231406 0.257289 0.262749 0.236394 0.256309 0.251970 0.231423 0.259707 0.232833
chargesum: 0.00000
title: Mulliken charges with hydrogens summed into heavy atoms:
elementType: Cl S C C C C C C C C C C C C C
charge: -0.062891 0.205816 -0.226127 0.600776 0.557034 -0.351088 -0.319344 -0.148308 -0.187875 0.011112 -0.014713 -0.090541 0.001021 0.026925 -0.001796
polarizability: 2.42180674e+02 -1.53710258e+00 1.61727449e+02 -6.44730394e+00 -8.03264690e+00 8.30784416e+01
1716.lowfreq: -5.8660 0.0008 0.0016 0.0020 2.2313 7.3667 40.8461 90.2629 127.9115
frequency: 40.8351 90.2620 127.9102 163.0008 199.5578 237.7231 263.2585 287.7853 317.1464 362.7924 381.6318 424.7201 431.9355 454.9750 502.6254 516.0773 529.5540 575.0099 629.6183 665.7089 687.7807 710.3285 727.6237 754.8984 813.4681 820.0385 861.9787 867.2142 874.2388 927.7095 945.0627 953.3178 984.1203 1020.1089 1035.0164 1046.6374 1079.5541 1115.0643 1136.7813 1168.5171 1174.3775 1202.1548 1211.5811 1252.9780 1265.6501 1308.6962 1370.3425 1379.0514 1397.7215 1430.4893 1440.2565 1449.5303 1464.3801 1570.2550 1583.1661 1588.0929 1603.8351 2940.5236 3060.2638 3124.5389 3136.6399 3149.3790 3150.2841 3155.9345 3167.3605 3175.9457
redmass: 6.1937 6.1351 4.8573 6.3515 6.0808 3.3699 8.0137 4.4182 5.7830 7.6087 5.0201 4.2051 3.2307 4.4745 3.9571 6.7851 4.1146 6.1300 4.9042 6.4805 5.9968 4.1328 4.6061 1.2477 1.3744 3.1960 3.5249 1.5096 1.5974 1.6934 1.3571 1.5936 1.3278 6.3711 2.9442 4.0146 2.0410 1.7243 1.4509 1.1252 1.0695 2.7452 2.1537 1.2497 1.3443 1.6402 7.6805 8.2439 3.5652 2.2009 1.2190 2.1863 2.3159 6.9147 6.8015 7.3054 7.1117 1.0676 1.0921 1.0870 1.0884 1.0894 1.0942 1.0927 1.1008 1.0968
irintensity: 0.1727 0.8558 0.1725 0.1846 0.0541 1.8823 0.6220 1.6882 1.0343 2.3349 0.4922 5.2888 1.1849 19.2741 5.8458 13.4129 8.9046 0.4470 4.9042 11.6005 2.6925 1.9956 5.0045 77.6109 39.8733 8.9640 25.9149 3.1792 11.9875 3.7616 0.5210 7.7559 0.0306 59.5044 8.6543 6.9897 43.7734 12.3929 4.9184 2.2634 1.5467 5.8955 1.5894 2.3053 5.3460 5.3323 1.1326 0.8030 14.6680 8.2123 19.9288 114.2597 11.0273 7.9390 12.9399 0.9324 5.7784 14.0557 13.3726 3.9765 5.4277 1.8445 18.7798 1.5506 28.9095 3.5136
temp: 298.150 k
press: 1.00000 atm
elementType: 17 16 6 6 6 6 6 6 6 6 6 6 6 6 6 1 1 1 1 1 1 1 1 1
symmnumber: 1
zpe: 463463.3 jmol-1
zpe.correction: 0.176524 hartree
zpe.thermalcorrener: 0.188487 hartree
zpe.thermalcorrenthalpy: 0.189431 hartree
zpe.thermalcorrgfe: 0.137676 hartree
zpe.sumelectzpe: -1357.886751 hartree
zpe.sumelectthermal: -1357.874787 hartree
zpe.sumelectthermalent: -1357.873843 hartree
zpe.sumelectthermalfe: -1357.925598 hartree
dipole: 1.9151 -0.5962 0.0683
dipole: 2.0069
quadrupole: -100.6895 -92.3624 -103.5699
quadrupole: -6.4323 -3.2627 -4.7758
quadrupole: -1.8156 6.5115 -4.6960 -6.4323 -3.2627 -4.7758
hfenergy: -1358.0632745 hartree
pointgroup: C01 [X(C13H9Cl1S1)]
dipole: -0.7719484 0.1622043 0.0345846 debye
dipolederiv: -0.7333927 -0.2694578 0.166711 -0.3711339 -0.2947003 0.0888811 0.2140743 0.0838634 -0.1266391 -0.5892012 0.0405717 -0.0142499 0.0581625 -0.0248873 -0.0339078 -0.0009655 0.0819268 -0.0663519 -0.104927 0.0278076 -0.0012803 0.0040677 0.1811071 0.0013982 -0.0121006 -0.0514795 0.0803203 0.0855647 -0.1427862 -0.0593177 -0.2925253 -0.0453949 0.0298817 -0.0456221 0.0772011 0.0032956 0.114207 0.1103909 0.0558064 0.3029975 -0.1905175 0.0408731 0.0688021 0.0754693 -0.0040065 0.6240157 0.2703131 -0.152809 0.5818369 -0.0778875 -0.0216883 -0.1177133 -0.0747521 -0.0559724 0.4669147 -0.3360872 0.17873 -0.6541537 0.1102511 -0.065431 0.1451545 -0.1101327 -0.0208178 -0.2965704 -0.0322557 0.0374823 -0.0808819 -0.0287436 0.0434837 0.0655672 0.0189682 -0.1272684 -0.0709817 -0.0186971 0.0515629 -0.0117582 0.1080355 0.0139694 0.0379782 -0.0116607 -0.1311762 -0.1857103 -0.0139051 -0.0207063 -0.1507959 0.0800993 0.0317688 -0.0411994 0.0100774 -0.0944348 -0.2617532 0.078275 -0.0049612 0.2061329 0.0424389 0.034035 -0.0128617 0.019451 -0.1182918 0.9339977 0.4255584 -0.2836003 0.5289572 0.3860107 -0.137987 -0.3196674 -0.1258502 0.0364674 -0.0582 -0.0606238 0.0626362 -0.0285987 0.0015204 -0.0376268 0.0379194 -0.0308943 -0.1281707 -0.2219304 -0.1224312 0.0051233 -0.099112 -0.109479 0.0408204 0.0091608 0.0446714 -0.1175014 0.0295841 0.0427662 0.0921531 -0.0215421 0.008658 0.0052956 0.1038646 0.0137989 -0.1140297 0.0299785 -0.0165385 -0.0031486 -0.0131496 -0.1153413 -0.0138823 0.0008615 0.0545008 0.09664 -0.0232769 0.0079288 0.006272 0.0116667 0.0817754 0.0480803 -0.0038471 -0.022777 -0.0855905 0.0903215 0.0173404 0.0247836 -0.0140236 -0.0381567 -0.0129326 0.0144346 -0.0160317 0.1486037 0.0755602 -0.0622383 -0.0332093 -0.0077481 -0.097865 -0.0104366 -0.023842 -0.0214922 0.1363669 0.0983413 -0.0451004 0.0256808 -0.0029875 -0.0504676 -0.0199839 0.0201969 -0.0086053 0.1434164 0.11711 0.0075422 -0.0288541 -0.0393938 -0.0632334 -0.0204265 -0.018621 -0.0064186 0.1428065 -0.0233406 0.0899093 -0.0717361 0.1061312 0.0014757 0.0432015 -0.0832449 0.0448302 0.1321579 -0.0111455 0.0564271 0.0602641 0.0399719 0.0715827 -0.022957 0.0720598 -0.0241311 0.147975 -0.0851654 -0.0547093 -0.093333 -0.0521203 0.0637195 -0.0244289 -0.1103887 -0.0205331 0.1222015 unknown
polarizability: 241.8018959|6.9260918|162.8603322|-2.5430856|-4.9175462|82.3243361 unknown
InChI: InChI=1S/C13H9ClS/c14-11-5-6-13-10(8-11)7-9-3-1-2-4-12(9)15-13/h1-6,8H,7H2
charge 0 multiplicity 1
24 atoms
Cl 4.752952 1.358176 -0.843812
S  -0.547345 -1.917196 0.844075
C  -0.257117 1.151339 1.02781
C  0.965443 0.436281 0.470695
C  -1.558066 0.681189 0.391121
C  0.959453 -0.97804 0.363508
C  -1.817453 -0.707293 0.275162
C  2.128189 1.142992 0.08246
C  -2.543523 1.588135 -0.066341
C  2.095189 -1.681325 -0.094836
C  -3.033734 -1.188399 -0.25671
C  3.255796 0.429289 -0.364428
C  -3.770176 1.122683 -0.591735
C  3.265739 -0.975795 -0.453369
C  -4.018036 -0.26685 -0.679693
H  -0.148605 2.244083 0.921647
H  -0.310183 0.930409 2.117018
H  2.154562 2.235157 0.145752
H  -2.35153 2.665331 0.005304
H  2.070348 -2.771985 -0.183903
H  -3.20581 -2.265799 -0.349265
H  -4.526711 1.838364 -0.93089
H  4.153454 -1.507876 -0.806123
H  -4.965138 -0.634475 -1.089047
