program: Gaussian 09
title: 000244107
version: EM64L-G09RevD.01
frameworkgroup: C1[X(C5H4Cl2N2S)]
method: RPBEPBE
basis: SDD
operation: Freq
keyword: #p
keyword: freq=noraman
keyword: PBEPBE/SDD
title: #p freq=noraman PBEPBE/SDD
converged: YES YES NO NO
title: Mulliken charges:
elementType: Cl Cl S N N C C C C C H H H H
charge: 0.024585 0.045217 0.246785 0.137830 0.081066 -0.075050 -0.170964 -0.245013 -0.318182 -0.829056 0.284012 0.266313 0.272051 0.280405
chargesum: 0.00000
title: Mulliken charges with hydrogens summed into heavy atoms:
elementType: Cl Cl S N N C C C C C
charge: 0.024585 0.045217 0.246785 0.137830 0.081066 -0.075050 -0.170964 0.038999 -0.318182 -0.010287
polarizability: 1.65996360e+02 2.61634481e+00 9.62058354e+01 9.90702194e-01 3.28595852e+00 5.28564760e+01
1716.lowfreq: -4.8474 -0.0012 -0.0012 0.0016 4.2844 7.5516 52.4588 71.5958 127.3070
frequency: 52.4490 71.5949 127.3049 159.2861 164.9702 187.5683 208.9958 306.5759 356.5302 378.3609 435.6410 449.6292 531.0878 617.9273 638.4140 651.3760 759.5614 777.2136 933.6927 969.4812 969.9669 996.6774 1143.0605 1177.1719 1224.4022 1250.9586 1342.2785 1356.7962 1437.4594 1443.7488 1462.8434 1499.2193 3021.4256 3145.0408 3155.0142 3164.7144
redmass: 4.2347 3.8120 1.1928 6.5505 7.4342 11.4170 9.6752 14.4039 8.6702 18.2515 7.1338 4.4699 13.7942 10.4139 7.4994 9.7468 8.4926 11.7845 1.4234 4.7555 1.3454 1.2900 8.1142 2.9019 9.6069 11.7608 1.1310 1.8945 7.2568 1.0679 1.0579 7.3131 1.0279 1.1038 1.1068 1.0936
irintensity: 1.7087 0.8456 0.4554 0.8321 0.6032 0.4457 0.7203 0.6877 1.0960 2.8149 5.0929 5.1366 21.6088 2.2156 3.6617 23.9587 5.5365 93.1855 11.1199 4.7947 14.7606 18.5611 44.0359 160.3281 64.4573 5.1047 0.8531 264.8870 159.4538 7.2937 23.1802 123.9235 23.6792 5.6368 6.9626 2.5949
temp: 298.150 k
press: 1.00000 atm
elementType: 17 17 16 7 7 6 6 6 6 6 1 1 1 1
symmnumber: 1
zpe: 218727.8 jmol-1
zpe.correction: 0.083309 hartree
zpe.thermalcorrener: 0.093535 hartree
zpe.thermalcorrenthalpy: 0.094479 hartree
zpe.thermalcorrgfe: 0.045843 hartree
zpe.sumelectzpe: -1619.856836 hartree
zpe.sumelectthermal: -1619.846610 hartree
zpe.sumelectthermalent: -1619.845665 hartree
zpe.sumelectthermalfe: -1619.894302 hartree
dipole: 3.5377 -1.1210 1.3097
dipole: 3.9354
quadrupole: -78.8518 -82.4042 -77.7435
quadrupole: -1.4453 5.2173 -0.2962
quadrupole: 0.8147 -2.7377 1.9230 -1.4453 5.2173 -0.2962
hfenergy: -1619.9401447 hartree
pointgroup: C01 [X(C5H4Cl2N2S1)]
dipole: -1.3969624 0.5971783 0.2985536 debye
dipolederiv: -0.3581349 -0.331707 0.120942 -0.3673989 -0.5317654 0.154332 0.1581581 0.1901422 -0.1216429 -0.972606 0.049816 -0.0868476 0.0903164 -0.0733186 0.0199026 -0.14766 0.021914 -0.0623595 -0.2979894 0.0011196 0.1093938 -0.125536 -0.0487536 -0.0341723 0.073025 -0.0035224 0.0783336 -1.3191509 -0.2996313 0.0382195 -0.2767345 -0.4295234 0.1414745 0.0288078 0.14717 -0.1530688 -0.8942893 -0.0447622 -0.0273354 0.3650152 -0.4261343 0.162936 -0.2277918 0.1428363 -0.2232941 0.4255115 -0.2521136 0.0963932 -0.2357803 -0.4888724 0.248296 0.1050627 0.2201906 -0.2019009 0.8068704 0.5809408 -0.1623502 0.4501699 1.0123603 -0.3632972 -0.244243 -0.3867025 0.208549 0.3403638 0.2543082 -0.0729952 0.0076871 0.3187083 -0.1698828 0.0934491 -0.1603537 0.0777859 2.0760558 -0.0020277 0.1706401 -0.0875869 0.5011059 -0.2281862 0.258081 -0.2243259 0.1748253 0.0243661 0.0126109 -0.144158 0.1471908 0.0057473 0.0303108 -0.1737286 0.0570212 0.1157752 0.057225 0.0350737 -0.0291361 0.0496108 0.0401842 0.0337022 -0.0356815 0.0406259 0.1019235 -0.0961339 0.0452905 -0.0043266 0.0576972 0.12949 0.0035441 0.0248763 -0.0075238 0.0780277 0.0553888 -0.0746468 -0.0163512 -0.044954 0.0099168 -0.076421 0.0638645 -0.0898773 -0.0545184 0.1525229 0.0257289 0.0079119 -0.0296966 -0.019145 0.0774613 0.0237805 0.0524055 -0.0184354 unknown
polarizability: 165.9218499|2.7630046|86.6410885|-2.3081835|-18.344359|62.4957333 unknown
InChI: InChI=1S/C5H4Cl2N2S/c1-10-3-2-8-5(7)9-4(3)6/h2H,1H3
charge 0 multiplicity 1
14 atoms
Cl -1.244096 -2.051862 0.767589
Cl 3.658227 0.055233 0.271181
S  -2.570738 0.732174 -0.753877
N  1.106067 -0.782921 0.428301
N  1.475202 1.374695 -0.601372
C  -0.804858 0.490347 -0.367893
C  -0.216112 -0.655543 0.23308
C  0.124341 1.488015 -0.77134
C  1.886585 0.236758 0.001344
C  -3.34551 0.735941 0.975951
H  -0.233539 2.406299 -1.246928
H  -4.410952 0.95637 0.807787
H  -2.888456 1.526754 1.58782
H  -3.232061 -0.25066 1.445857
