program: Gaussian 09
title: 000244106
version: EM64L-G09RevD.01
frameworkgroup: C1[X(C14H17N3OS2)]
method: RPBEPBE
basis: SDD
operation: Freq
keyword: #p
keyword: freq=noraman
keyword: PBEPBE/SDD
title: #p freq=noraman PBEPBE/SDD
converged: YES YES NO NO
title: Mulliken charges:
elementType: S S O N N N C C C C C C C C C C C C C C H H H H H H H H H H H H H H H H H
charge: 0.158024 0.279097 -0.264384 -0.437775 -0.037474 0.026274 0.459887 0.338353 -0.479925 -0.312037 0.286508 -0.330413 -0.379886 -0.336468 -0.244189 -0.285716 -0.377178 -0.684592 -0.830280 -0.836920 0.310502 0.224182 0.309716 0.245948 0.248148 0.206159 0.207090 0.266710 0.207055 0.232846 0.232419 0.277187 0.267439 0.258997 0.271892 0.246712 0.276092
chargesum: 0.00000
title: Mulliken charges with hydrogens summed into heavy atoms:
elementType: S S O N N N C C C C C C C C C C C C C C
charge: 0.158024 0.279097 -0.264384 -0.127273 -0.037474 0.026274 0.459887 0.338353 -0.255743 -0.002321 0.286508 -0.084465 -0.131738 -0.336468 0.169060 -0.019006 -0.377178 -0.012273 -0.026655 -0.042224
polarizability: 3.45156119e+02 -8.86074524e-01 2.67410290e+02 1.56569270e+00 2.49916372e+00 1.12028541e+02
1716.lowfreq: -6.2203 0.0015 0.0019 0.0021 3.5099 5.0944 27.0147 30.0157 47.2018
frequency: 26.5460 30.0011 47.1963 50.8214 58.7602 73.6064 97.9567 111.2709 122.4297 131.1348 143.6131 162.5848 166.4301 171.6393 179.6868 223.1380 243.2155 250.6056 283.5463 326.6086 354.7596 372.0976 374.9444 398.0580 415.6322 443.2669 452.8580 503.5328 522.6055 566.4329 621.1409 626.8582 650.5628 655.7137 670.0026 722.5398 728.5357 744.6506 755.1831 780.1703 804.1781 830.2376 837.1035 849.0609 902.4507 922.2861 934.4705 937.8001 966.7355 978.6725 982.3184 984.7974 987.0960 996.0441 1001.4729 1037.6227 1113.9481 1120.2572 1136.1941 1165.4440 1179.7602 1190.7910 1216.1693 1248.9978 1261.6945 1285.4173 1304.1390 1326.3211 1339.4373 1348.2622 1355.8100 1370.6356 1399.4171 1415.7676 1431.2585 1440.8898 1442.9496 1447.2502 1458.4836 1459.1327 1460.8933 1476.6872 1487.1778 1504.6586 1523.5483 1560.7158 1598.9318 1630.0118 2950.5652 2997.2748 3008.0857 3013.8373 3018.4410 3094.5633 3106.1940 3113.4855 3138.4800 3141.2287 3144.1602 3145.3900 3146.3867 3158.1315 3165.3853 3205.6720 3397.8362
redmass: 3.2316 4.1923 3.5946 3.9212 4.8631 5.1717 4.5307 1.7653 3.9246 1.1219 3.9570 5.1824 4.0917 3.2414 1.3091 5.5110 1.2388 4.8890 5.6397 9.0143 6.9027 5.5465 5.1418 4.8387 3.0743 5.0225 4.5105 9.0814 2.3916 7.4278 6.6870 7.2519 7.1389 7.4600 7.4908 3.5011 6.9016 1.7727 4.7837 2.8930 1.3317 1.1194 5.5011 1.5020 3.2726 1.3840 1.4081 5.6783 1.1774 1.2142 4.0181 1.2776 1.2769 1.6481 2.5781 2.8349 1.7607 1.5170 1.4406 3.8963 1.4070 3.5518 2.4319 3.7357 1.1427 5.2486 1.4370 1.6936 1.1331 1.3348 2.4140 1.5744 1.2776 4.2667 3.0009 1.0530 1.1356 3.4224 1.0642 1.1010 1.0400 1.0849 1.1608 2.1168 6.0571 3.8994 3.1806 6.3564 1.0552 1.0362 1.1075 1.0278 1.0281 1.0989 1.1013 1.0899 1.1048 1.1037 1.1048 1.0942 1.1058 1.0910 1.0934 1.0939 1.0753
irintensity: 1.1688 0.2742 0.6934 2.3381 0.4459 1.2838 1.2579 2.1192 0.9757 0.0513 0.1739 1.3882 2.6588 3.5239 0.9563 0.0987 0.8427 4.6802 0.3372 0.7224 2.3543 0.4949 1.0122 7.2633 0.0206 3.8823 3.1024 3.6518 22.2274 31.8431 1.8368 1.1098 0.3354 0.1618 0.7103 0.4653 4.1694 4.7975 7.7793 13.3541 72.8872 0.1124 5.3348 60.2050 61.6490 1.7740 12.1118 40.5094 3.3510 7.2029 5.3361 29.7219 0.5361 6.1732 4.5901 98.0681 4.3618 19.2538 4.4835 177.0685 88.3851 34.2720 301.6152 42.4731 0.0972 17.0243 9.7365 233.7453 0.4155 49.7020 32.8038 21.6816 27.1751 57.1820 47.2354 14.8665 15.9541 49.2174 32.7071 1.6290 11.9424 73.5565 95.3935 323.4115 380.2352 468.4445 288.7078 1.9796 47.7046 30.4286 38.7018 26.0255 17.1603 30.1203 34.2950 18.2183 12.3515 16.8481 7.1027 12.6414 12.4088 4.7375 16.3168 11.2488 76.4484
temp: 298.150 k
press: 1.00000 atm
elementType: 16 16 8 7 7 7 6 6 6 6 6 6 6 6 6 6 6 6 6 6 1 1 1 1 1 1 1 1 1 1 1 1 1 1 1 1 1
symmnumber: 1
zpe: 752803.1 jmol-1
zpe.correction: 0.286728 hartree
zpe.thermalcorrener: 0.307890 hartree
zpe.thermalcorrenthalpy: 0.308835 hartree
zpe.thermalcorrgfe: 0.234457 hartree
zpe.sumelectzpe: -1577.808732 hartree
zpe.sumelectthermal: -1577.787569 hartree
zpe.sumelectthermalent: -1577.786625 hartree
zpe.sumelectthermalfe: -1577.861003 hartree
dipole: 4.5978 -3.8553 1.3842
dipole: 6.1579
quadrupole: -130.2103 -120.9771 -136.2424
quadrupole: 5.1466 -5.6656 -3.6778
quadrupole: -1.0670 8.1661 -7.0991 5.1466 -5.6656 -3.6778
hfenergy: -1578.0954597 hartree
pointgroup: C01 [X(C14H17N3O1S2)]
dipole: -1.7127947 -1.4272621 -0.9480068 debye
polarizability: 342.7850188|-0.7080158|264.2157826|23.1767549|22.3059294|117.5941478 unknown
InChI: InChI=1S/C14H17N3OS2/c1-4-18-11-7-5-10(6-8-11)16-13-12(19-2)9-15-14(17-13)20-3/h5-9,16H,4H2,1-3H3
charge 0 multiplicity 1
37 atoms
S  3.238839 -2.935251 0.371373
S  3.329376 3.41336 0.864099
O  -4.5896 0.597402 -0.324935
N  0.807049 -1.030652 0.24665
N  2.018251 1.019787 0.531107
N  4.440187 0.983669 0.864165
C  -0.53504 -0.581964 0.110571
C  -3.272687 0.131173 -0.184663
C  -1.535205 -1.578794 -0.029276
C  -0.923223 0.786837 0.102777
C  1.990721 -0.349915 0.428771
C  -2.894507 -1.235063 -0.175816
C  -2.277835 1.130058 -0.044279
C  3.220591 -1.102327 0.518973
C  -5.660679 -0.407099 -0.472199
C  4.401817 -0.380265 0.750118
C  3.229095 1.603443 0.734512
C  -6.972523 0.361515 -0.605624
C  3.465472 -3.099615 -1.510331
C  1.525515 3.893768 0.655432
H  0.941472 -2.052134 0.248161
H  -1.251811 -2.639305 -0.021137
H  -0.156568 1.553003 0.215904
H  -3.636186 -2.031956 -0.279187
H  -2.589292 2.17933 -0.051515
H  -5.464389 -1.0271 -1.371738
H  -5.67094 -1.069475 0.418342
H  5.358047 -0.904631 0.850124
H  -7.81616 -0.343137 -0.720681
H  -7.153004 0.981145 0.289186
H  -6.946804 1.024594 -1.487055
H  4.438114 -2.67441 -1.796768
H  2.648189 -2.583762 -2.036482
H  3.440727 -4.178373 -1.730583
H  1.16283 3.574555 -0.332226
H  1.504222 4.991799 0.737975
H  0.921138 3.434997 1.450961
