program: Gaussian 09
title: 000244098
version: EM64L-G09RevD.01
frameworkgroup: C1[X(C7H12N4OS)]
method: RPBEPBE
basis: SDD
operation: Freq
keyword: #p
keyword: freq=noraman
keyword: PBEPBE/SDD
title: #p freq=noraman PBEPBE/SDD
converged: YES YES NO NO
title: Mulliken charges:
elementType: S O N N N N C C C C C C C H H H H H H H H H H H H
charge: 0.228410 -0.288554 -0.149601 -0.143415 -0.028418 -0.517668 0.230041 -0.211427 0.224636 -0.432649 -0.634102 -0.633268 -0.807635 0.257553 0.288777 0.245814 0.245703 0.262343 0.233454 0.233685 0.297946 0.297248 0.246448 0.277515 0.277163
chargesum: 0.00000
title: Mulliken charges with hydrogens summed into heavy atoms:
elementType: S O N N N N C C C C C C C
charge: 0.228410 -0.288554 -0.149601 -0.143415 -0.028418 0.077526 0.230041 -0.211427 0.224636 -0.175095 0.146192 0.096214 -0.006509
polarizability: 1.65078512e+02 -2.34211276e+00 1.63736914e+02 7.35609617e-02 -4.46444793e-02 6.71907378e+01
1716.lowfreq: -10.8858 0.0024 0.0025 0.0028 2.3150 7.2921 56.9673 62.9161 83.7390
frequency: 56.9624 62.9080 83.7348 100.8319 114.0770 131.0331 132.0089 173.5224 192.0248 207.0407 209.2081 234.3672 264.4849 291.0093 329.1419 366.1835 370.1671 433.2005 496.9524 571.7858 597.8607 632.0538 665.5253 673.9666 714.1537 715.5707 769.2367 809.0516 812.7481 897.5674 984.1034 984.2906 999.1910 1067.1583 1113.5891 1117.8682 1122.4311 1185.7846 1203.0234 1250.9316 1271.6199 1304.9951 1311.6646 1339.6955 1398.1861 1414.4736 1432.5201 1435.0486 1449.9919 1470.0492 1472.4361 1487.0318 1489.2157 1520.9859 1552.9718 1646.4628 1676.1297 2957.3874 2989.2923 3024.7261 3028.5943 3081.9616 3111.0692 3138.9907 3149.8821 3159.1973 3209.0166 3373.8295 3486.0065
redmass: 3.0700 2.6002 3.5886 3.1346 1.1094 3.7877 1.4590 1.1204 2.1589 3.4938 2.5353 1.6275 4.5498 5.0520 3.8621 5.4119 4.5297 6.4553 4.7471 5.5255 5.9061 5.4271 7.2402 9.2228 3.3318 5.4586 3.0844 1.8194 2.5473 4.0660 1.7687 1.1946 1.7437 2.6742 1.2717 1.8995 1.3054 2.5225 2.9454 2.9215 1.1482 3.9072 3.7364 1.1566 2.3784 1.3064 1.0534 1.7447 1.0695 1.0740 1.0431 1.0701 1.0434 6.3302 6.6286 6.9227 1.1259 1.0380 1.0328 1.0280 1.1015 1.1027 1.1001 1.0957 1.1040 1.1060 1.0916 1.0426 1.0984
irintensity: 0.0578 0.1730 2.9167 1.6915 3.4947 0.8489 10.6101 0.6362 15.1845 0.4477 4.9344 41.5095 0.0204 1.0947 5.3856 1.3633 14.2313 16.4980 9.4885 11.2269 1.2050 8.4257 4.6893 0.0215 0.0037 12.0588 83.4361 53.4405 77.9979 2.1554 24.6901 8.1019 7.1536 168.4032 0.2100 40.1288 0.3288 4.0761 33.3279 4.9138 0.3956 82.2420 38.7175 2.1351 119.2610 46.1203 15.6409 114.7275 18.5455 48.0994 16.3044 28.3855 20.8586 297.2900 321.8687 683.8592 24.9578 54.4922 29.2129 18.9349 37.6031 17.5380 2.1972 4.8021 7.4211 11.4507 2.5715 1.6134 0.3990
temp: 298.150 k
press: 1.00000 atm
elementType: 16 8 7 7 7 7 6 6 6 6 6 6 6 1 1 1 1 1 1 1 1 1 1 1 1
symmnumber: 1
zpe: 511524.3 jmol-1
zpe.correction: 0.194829 hartree
zpe.thermalcorrener: 0.209714 hartree
zpe.thermalcorrenthalpy: 0.210658 hartree
zpe.thermalcorrgfe: 0.152766 hartree
zpe.sumelectzpe: -965.212777 hartree
zpe.sumelectthermal: -965.197893 hartree
zpe.sumelectthermalent: -965.196948 hartree
zpe.sumelectthermalfe: -965.254840 hartree
dipole: 0.1844 -4.7554 0.0235
dipole: 4.7591
quadrupole: -76.4075 -92.9677 -84.8467
quadrupole: 3.5993 0.0952 -0.0776
quadrupole: 8.3331 -8.2271 -0.1061 3.5993 0.0952 -0.0776
hfenergy: -965.4076065 hartree
pointgroup: C01 [X(C7H12N4O1S1)]
dipole: -0.2777796 1.8329647 -0.2623629 debye
dipolederiv: -0.2934005 -0.4143976 0.0661972 -0.3050761 -0.4006279 0.0512518 0.0495729 0.0527007 -0.109467 -0.662682 0.3128216 -0.041814 0.3181538 -1.4129824 0.1517654 -0.0427794 0.1519013 -0.391813 -0.7890602 -0.258554 0.0518892 0.0445067 -1.2314818 0.1684988 0.0069895 0.1743222 -0.1383714 -1.2353271 0.4585842 -0.049012 0.2637546 -0.2448908 -0.0095247 -0.0187311 -0.0087216 -0.2651486 -1.7691704 -0.4919059 0.1040576 -0.0711658 -0.5706701 0.056218 0.0390022 0.0651554 -0.2186633 -0.5594996 0.0736802 -0.0059319 -0.0696725 -0.0113669 0.0003068 0.0164688 -0.0029175 -0.0422066 1.7893449 -0.2704335 0.0093968 -0.3823784 0.8889631 -0.1007317 0.026453 -0.1032212 0.1927248 1.454756 0.589675 -0.116306 -0.0421902 1.1065821 -0.1612126 -0.0210393 -0.1725701 0.0630639 1.2061538 -0.268554 0.021178 -0.1520539 1.7940595 -0.2404838 0.0042602 -0.2384212 0.2208832 -0.74271 0.524417 -0.0718204 0.5008129 -0.7247181 0.0516808 -0.0664192 0.0495416 -0.3261542 0.3113436 -0.1056494 0.014465 -0.1351076 -0.0085589 0.0352205 0.0185891 0.0342501 0.2035905 0.429181 0.0795572 -0.0150026 0.3332005 0.1657891 0.0085628 -0.0571172 0.0136712 0.256634 0.0019942 -0.0332762 0.0068845 -0.0216876 0.1738389 -0.0171489 0.0051273 -0.0169573 0.061684 -0.0043449 -0.0522135 0.0118102 -0.0862279 0.0305723 0.0257288 0.0166851 0.0253414 0.1854632 0.2109644 -0.0587758 0.0072533 0.1199885 0.0192446 0.0148379 -0.0197035 0.0184625 0.1325034 -0.0243522 0.0050263 -0.0411567 -0.0645854 0.0893412 -0.1065478 -0.0642282 -0.081468 -0.0138242 -0.0199116 0.0186304 0.0368458 -0.0404953 0.1332983 0.0630601 0.0789485 0.0357445 -0.0614572 -0.0295369 0.0582519 -0.0064444 0.1257626 0.0697178 0.0071863 -0.0166142 0.0081263 0.1278762 0.0393728 0.0020317 -0.0412573 -0.1330664 0.0148221 0.0916974 0.0626859 0.0813563 -0.1085912 0.0392505 0.0114884 0.0368069 -0.1499658 -0.043668 -0.1070834 -0.0231502 -0.1011495 -0.0492043 0.2826069 -0.1254924 0.1703483 0.0050381 0.0669557 0.0126393 0.1224793 0.0085489 0.0926647 0.2831754 -0.1719942 -0.1301931 -0.0286412 0.0600181 -0.0051778 -0.121268 -0.0005851 0.0972114 0.0129413 -0.1058197 0.0175054 -0.0867057 -0.0483121 0.0281932 0.0147167 0.0285997 0.1259868 0.0374648 0.1264997 0.082669 0.0392642 0.0440742 -0.0038967 0.0628628 -0.0066987 -0.021859 0.0314459 0.0964024 -0.1183685 0.018538 0.04 -0.0150405 -0.0737911 -0.0150118 -0.013526 unknown
polarizability: 165.5389672|-2.3935224|161.1218263|-1.5338469|-14.1056172|69.34537 unknown
InChI: InChI=1S/C7H12N4OS/c1-10-6(12)4-5(11(2)8)9-7(10)13-3/h4H,8H2,1-3H3
charge 0 multiplicity 1
25 atoms
S  2.541734 1.66815 -0.350599
O  0.967317 -3.116662 0.402945
N  1.584493 -0.859937 0.049885
N  -2.374293 0.400335 -0.06529
N  -0.071029 0.860946 -0.178491
N  -2.637137 1.787955 -0.271648
C  -1.077335 -0.093889 -0.014561
C  1.188677 0.445929 -0.140439
C  0.572782 -1.922833 0.230219
C  -0.785018 -1.454708 0.185367
C  3.005686 -1.259908 0.084112
C  -3.538756 -0.481334 0.08284
C  1.524059 3.231039 -0.566398
H  -1.560382 -2.209264 0.315136
H  3.016807 -2.349332 0.246251
H  3.534605 -0.753424 0.910626
H  3.502744 -1.018881 -0.872016
H  -4.435656 0.147098 -0.000889
H  -3.539986 -0.989098 1.067647
H  -3.562569 -1.25697 -0.708078
H  -2.233216 2.09635 -1.168721
H  -2.2334 2.345155 0.496477
H  2.261002 4.038734 -0.697953
H  0.910674 3.397005 0.329523
H  0.882296 3.133042 -1.452446
