program: Gaussian 09
title: 000020896
version: EM64L-G09RevD.01
frameworkgroup: C1[X(C7H17N5)]
method: RPBEPBE
basis: SDD
operation: Freq
keyword: #pfreq=noraman
keyword: PBEPBE/SDD
title: #p freq=noraman PBEPBE/SDD
converged: YES YES NO NO
title: Mulliken charges:
elementType: N N N N N C C C C C C C H H H H H H H H H H H H H H H H H
charge: -0.281422 -0.220918 -0.655004 -0.631976 -0.650198 -0.343857 -0.389499 -0.345938 -0.434972 -0.696218 0.244340 0.242023 0.178443 0.212664 0.197590 0.179150 0.187851 0.191632 0.181813 0.210510 0.212007 0.209169 0.209515 0.327843 0.323473 0.302348 0.332718 0.427068 0.279844
chargesum: 0.00000
title: Mulliken charges with hydrogens summed into heavy atoms:
elementType: N N N N N C C C C C C C
charge: -0.281422 -0.220918 -0.003688 0.003091 0.056715 0.047249 -0.012758 0.033546 -0.042649 -0.065526 0.244340 0.242023
polarizability: 1.41998421e+02 1.00457735e+01 1.33702051e+02 9.55895668e+00 -6.85569871e+00 8.04698573e+01
1716.lowfreq: -11.9435 -1.7891 -0.0010 -0.0008 -0.0007 4.1407 25.8590 34.6536 62.0051
frequency: 25.4827 34.3520 61.8843 95.4301 103.9734 125.3122 151.0338 173.4558 210.5239 227.5148 254.6319 272.9334 287.7909 336.8655 376.2139 395.0815 421.0407 439.6721 484.0450 512.8296 521.6503 530.9306 680.4613 682.2728 713.2041 729.3622 774.0008 843.6949 854.6595 899.6334 920.6467 963.5505 999.0175 1002.6652 1014.9390 1049.9392 1078.8493 1084.6495 1113.1884 1132.6649 1133.5816 1172.2213 1204.7302 1224.7934 1272.0984 1282.8356 1285.3520 1336.6779 1341.5113 1359.5323 1385.3344 1392.9268 1420.6321 1455.1595 1459.0886 1467.4777 1475.3279 1477.8182 1488.5150 1506.4094 1556.3685 1597.8033 1601.8542 1655.9913 2703.4363 2865.1747 2911.4776 2955.5679 2961.9826 2969.9067 2971.8417 2999.5482 3016.8639 3042.1808 3067.2151 3067.9411 3563.7223 3564.7454 3591.8312 3720.6077 3720.8590
redmass: 3.6271 3.7779 1.6598 3.8167 2.9254 3.5186 2.5615 2.5743 1.4349 1.1291 2.7587 2.4127 2.1573 1.3527 2.8386 2.7297 3.5768 1.2085 2.8850 1.1255 1.1133 2.8436 4.2827 8.2313 8.7625 1.0877 1.2990 2.7643 1.7096 1.7954 1.9163 1.8233 1.9374 1.0734 2.0419 2.4662 1.9308 1.9115 2.2090 1.7970 2.9662 1.8193 1.3999 1.3171 1.2532 1.1152 1.1324 1.4484 1.3581 1.6198 1.2219 3.1412 2.0011 1.0836 1.1055 1.0673 1.0435 1.0671 1.0875 3.3515 3.0118 1.3886 1.5226 2.2586 1.0826 1.0574 1.0981 1.0606 1.0614 1.0363 1.0618 1.0954 1.0998 1.1035 1.1005 1.0994 1.0442 1.0448 1.0817 1.1047 1.1052
irintensity: 0.2007 0.0855 0.0637 0.5933 1.9317 3.9823 5.3048 0.6191 53.8246 1.1801 26.9014 45.2627 28.9713 113.1998 4.5065 5.1798 1.6808 435.2490 0.9111 48.6421 54.4478 11.5096 5.4941 0.3218 11.4826 5.9575 3.2981 5.2695 2.5350 6.1331 6.4181 0.7978 14.5293 110.5108 2.2637 0.6349 1.5302 4.4974 14.7066 5.1444 49.8821 0.2627 1.0607 5.5347 1.7761 1.5180 0.4232 0.5458 83.4890 9.2567 11.2077 170.2613 165.0437 5.1477 23.9810 0.4224 11.8274 3.2455 15.7641 104.8718 257.3824 325.4423 294.4023 833.8795 622.5196 70.2465 55.3748 2.6701 26.8212 50.7684 101.8264 11.2108 3.2232 67.6867 95.6587 60.0555 42.8240 63.4809 14.4528 27.9411 31.1155
temp: 298.150 k
press: 1.00000 atm
elementType: 7 7 7 7 7 6 6 6 6 6 6 6 1 1 1 1 1 1 1 1 1 1 1 1 1 1 1 1 1
symmnumber: 1
zpe: 656923.2 jmol-1
zpe.correction: 0.250209 hartree
zpe.thermalcorrener: 0.265152 hartree
zpe.thermalcorrenthalpy: 0.266096 hartree
zpe.thermalcorrgfe: 0.207266 hartree
zpe.sumelectzpe: -549.748084 hartree
zpe.sumelectthermal: -549.733141 hartree
zpe.sumelectthermalent: -549.732196 hartree
zpe.sumelectthermalfe: -549.791027 hartree
dipole: -0.9389 -1.0748 0.1272
dipole: 1.4328
quadrupole: -68.4080 -55.6973 -77.8304
quadrupole: 7.9904 1.7201 -4.8332
quadrupole: -1.0961 11.6146 -10.5185 7.9904 1.7201 -4.8332
hfenergy: -549.9982925 hartree
pointgroup: C01[X(C7H17N5)]
dipole: -0.3856789 -0.3985592 0.1008653 debye
polarizability: 143.2301718|10.2440599|130.7615812|6.7732152|-12.754324|82.1785766 unknown
InChI: InChI=1S/C7H17N5/c1-2-3-4-5-11-7(10)12-6(8)9/h2-5,8-10H2,1H3
charge 0 multiplicity 1
29 atoms
N  -0.367627 0.700274 0.07893
N  -2.673855 0.169217 -0.41492
N  -1.87482 2.266828 -0.96602
N  -3.706827 -1.858785 0.055778
N  -1.418122 -1.569011 0.653649
C  2.57188 -0.037782 -0.427572
C  2.043892 1.055089 0.526108
C  3.846505 -0.738976 0.094257
C  0.722743 1.69167 0.045942
C  4.379126 -1.81855 -0.872711
C  -1.570516 1.026792 -0.4067
C  -2.567874 -1.068012 0.100521
H  2.783264 0.414073 -1.420106
H  1.771875 -0.786512 -0.591547
H  1.87655 0.621835 1.532731
H  2.809558 1.850719 0.63845
H  4.63611 0.020088 0.273496
H  3.629911 -1.1984 1.080803
H  0.881171 2.094627 -0.985269
H  0.484629 2.565394 0.698056
H  5.287123 -2.309179 -0.475305
H  4.634642 -1.378075 -1.855099
H  3.618143 -2.60271 -1.047098
H  -1.184788 3.006778 -1.04084
H  -2.820258 2.403517 -1.313032
H  -3.730201 -2.806498 0.418581
H  -4.537773 -1.446145 -0.358855
H  -0.627135 -0.841541 0.614137
H  -1.357226 -2.506523 1.046135
