program: Gaussian 09
title: 000244081
version: EM64L-G09RevD.01
frameworkgroup: C1[X(C9H8Cl2N6)]
method: RPBEPBE
basis: SDD
operation: Freq
keyword: #p
keyword: freq=noraman
keyword: PBEPBE/SDD
title: #p freq=noraman PBEPBE/SDD
converged: YES YES NO NO
title: Mulliken charges:
elementType: Cl Cl N N N N N N C C C C C C C C C H H H H H H H H
charge: -0.058931 -0.056375 -0.411290 -0.157645 -0.171621 -0.134967 -0.587444 -0.587315 0.575768 -0.357128 -0.283850 0.114362 -0.218995 -0.225993 -0.107950 0.052210 0.089527 0.337722 0.320406 0.279490 0.253294 0.335471 0.334767 0.330490 0.335998
chargesum: 0.00000
title: Mulliken charges with hydrogens summed into heavy atoms:
elementType: Cl Cl N N N N N N C C C C C C C C C
charge: -0.058931 -0.056375 -0.073569 -0.157645 -0.171621 -0.134967 0.082795 0.079172 0.575768 -0.357128 0.036556 0.114362 0.060495 0.027302 -0.107950 0.052210 0.089527
polarizability: 2.85757452e+02 -1.48079200e+01 1.87734060e+02 -3.03175784e-02 5.73506069e-02 6.08286730e+01
1716.lowfreq: -6.9055 -3.9686 -0.0020 -0.0018 0.0021 2.9196 30.4078 42.3289 76.2722
frequency: 30.3987 42.3067 76.2719 113.8403 165.3258 166.2097 185.9133 191.4831 191.8079 220.6430 235.8251 322.4124 346.0193 363.3999 394.9192 440.8459 447.5365 476.1110 487.3899 488.7016 541.4837 543.3840 545.4608 556.3241 592.5379 644.8382 675.3703 705.0934 713.4266 717.9337 734.1614 748.6558 797.8166 832.9026 838.3878 855.1359 901.7798 937.1844 983.5946 1015.1948 1016.7187 1079.3606 1116.9346 1128.2171 1143.5165 1229.9405 1269.4891 1296.9647 1335.6928 1385.0785 1396.2516 1431.3277 1463.5960 1494.0247 1498.2716 1532.9928 1545.3960 1574.6481 1600.1073 1608.8980 1639.0828 3165.3594 3180.7113 3185.6493 3486.9549 3557.6966 3559.7574 3717.5348 3718.3303
redmass: 6.7656 7.1408 8.1223 7.4269 6.0500 17.3429 6.3637 8.7835 7.9352 6.2229 8.5196 2.9515 6.5948 8.0713 6.9962 3.5098 5.8528 1.1961 3.8126 1.2156 1.1011 1.0800 3.1031 8.2392 7.3024 7.0467 2.5962 6.7156 7.2607 8.7077 5.9053 1.7535 7.8089 5.5952 1.3713 1.3809 13.3016 2.1838 1.3042 3.5006 4.2469 2.1342 2.8950 2.3917 1.4615 1.7038 3.0060 2.4349 3.5799 3.7217 5.5196 4.3796 2.7137 2.7932 6.8895 2.8670 3.1465 3.8662 1.4636 4.5168 2.5590 1.0895 1.0961 1.0939 1.0750 1.0442 1.0446 1.1058 1.1058
irintensity: 0.0301 0.1293 0.2179 1.2023 0.0168 1.6757 7.4459 1.4131 0.2025 9.1064 0.3478 5.1872 1.3549 11.1595 10.7257 5.4353 9.7859 50.1106 14.4945 508.4049 47.1141 0.0418 7.2910 5.5491 3.0143 6.1254 23.9559 0.5218 1.1261 48.8272 1.5487 38.0203 61.4933 22.0497 54.7499 26.2017 0.3352 2.7201 5.1323 11.8194 41.4942 20.9930 0.9156 0.2034 9.9310 6.3362 22.0841 4.1012 20.0394 155.1558 19.8636 8.1608 272.8139 37.0317 2015.1548 215.8683 405.5617 191.0382 656.0005 187.8266 43.2419 8.8197 23.4413 1.2114 66.8240 148.9512 83.8444 40.9992 54.8781
temp: 298.150 k
press: 1.00000 atm
elementType: 17 17 7 7 7 7 7 7 6 6 6 6 6 6 6 6 6 1 1 1 1 1 1 1 1
symmnumber: 1
zpe: 458328.4 jmol-1
zpe.correction: 0.174568 hartree
zpe.thermalcorrener: 0.189683 hartree
zpe.thermalcorrenthalpy: 0.190627 hartree
zpe.thermalcorrgfe: 0.131105 hartree
zpe.sumelectzpe: -1595.231964 hartree
zpe.sumelectthermal: -1595.216849 hartree
zpe.sumelectthermalent: -1595.215905 hartree
zpe.sumelectthermalfe: -1595.275427 hartree
dipole: -4.1297 -1.1877 -0.0088
dipole: 4.2971
quadrupole: -100.3382 -95.2751 -117.0341
quadrupole: 1.8651 0.0024 0.0727
quadrupole: 3.8776 8.9407 -12.8183 1.8651 0.0024 0.0727
hfenergy: -1595.4065321 hartree
pointgroup: C01 [X(C9H8Cl2N6)]
dipole: 1.6226253 0.4741557 0.0208766 debye
dipolederiv: -0.1672831 0.0888099 0.0015149 0.031183 -0.7368338 -0.0171082 0.0000845 -0.0160199 -0.0544997 -0.933432 0.2404339 0.0004813 0.2812617 -0.2179434 -0.0020275 0.0020083 -0.0025414 -0.066403 -2.5678 -0.1196983 -0.0208831 -0.3508132 -0.3439946 -0.0040754 -0.0292319 -0.0031725 -0.329068 -2.2514132 0.1890952 -0.014071 0.1651536 -0.6610746 -0.0079968 -0.0170776 -0.007639 -0.2448781 -1.3874399 -0.4544035 -0.0213553 -0.7970316 -1.1212288 -0.0280431 -0.0313651 -0.0258244 -0.2107106 -0.9664985 0.319415 0.0007709 0.1630249 -1.3843365 -0.0239891 -0.0037218 -0.0226193 -0.254379 -1.3129065 0.6444072 0.0094792 0.7844265 -0.6943681 0.008457 0.0114563 0.0075683 -0.7182239 -0.309388 -0.1865713 0.0000951 -0.4347349 -1.4765216 -0.0226491 -0.0069158 -0.023402 -0.7101736 1.6294866 -0.0671574 0.0090072 -0.7334471 -0.2252442 -0.0139896 -0.006287 -0.0084842 0.1136854 -0.1744241 -0.061356 -0.0022714 -0.0972182 1.0691925 0.0290861 -0.0034475 0.0282313 -0.108572 -0.2967106 -0.1342584 -0.0050729 0.2808503 0.0014352 0.0058221 0.0058841 0.0026099 -0.1480493 2.8629234 0.1523614 0.0284289 0.8541298 1.0993054 0.0276483 0.0494541 0.0225568 0.210859 -0.2286867 0.0586317 0.0002317 0.1524634 -0.2217359 -0.0032695 0.0026867 -0.0037172 -0.0486669 -0.1894416 0.1227244 0.0025619 -0.0049654 0.0359943 0.0035309 -0.000832 0.0046814 -0.1065086 1.109824 -0.3585713 -0.0017357 -0.3956168 0.2019453 0.004958 -0.0027396 0.0053395 -0.0900876 2.3042934 -0.5420478 0.0071719 -0.4206109 1.4137252 0.0231739 0.0127135 0.0221823 0.2126054 1.3864418 0.1448808 0.0143072 0.5197416 2.0303293 0.0465339 0.0241671 0.0440716 0.2119182 0.2403295 0.038799 0.0003861 0.0812757 0.2391097 -0.0005755 0.0008374 -0.0004948 0.2968208 0.2677196 -0.0148558 0.0008507 -0.0426451 0.0410454 -0.0034202 0.0002376 -0.0031836 0.1660895 0.0523078 -0.0452494 -0.0018723 -0.0495287 0.0668732 -0.002981 -0.0019306 -0.0029636 0.1720127 0.0849532 0.0242846 0.0001646 0.0448028 -0.0370707 -0.0048243 0.0006359 -0.0049418 0.163004 0.2058367 -0.0423021 -0.0029039 -0.1074414 0.2394489 -0.004545 -0.0040913 -0.0041895 0.3883542 0.2917397 -0.0505445 -0.0021608 -0.0141701 0.1660085 -0.0053377 -0.0010941 -0.0057741 0.3880294 0.1488278 -0.0131019 -0.0029745 0.0370605 0.2687543 -0.0019495 -0.0016879 -0.0010911 0.3794513 0.2007408 0.0662746 -0.000151 0.0528497 0.2471851 -0.0024289 0.0002565 -0.0011825 0.3873901 unknown
polarizability: 285.8739737|-14.4078006|187.5336404|1.4123783|2.9822825|60.9125709 unknown
InChI: InChI=1S/C9H8Cl2N6/c10-4-1-2-6(5(11)3-4)14-9-16-7(12)15-8(13)17-9/h1-3,14H,12-13H2
charge 0 multiplicity 1
25 atoms
Cl -2.054518 -3.087868 -0.12835
Cl -5.611733 1.176945 -0.042146
N  0.072189 -0.943156 -0.061803
N  2.35859 -1.231637 -0.043256
N  1.43815 1.027073 -0.000362
N  3.863711 0.691878 0.016262
N  4.683133 -1.501131 -0.02593
N  2.927113 2.833264 0.0566
C  -1.222417 -0.396261 -0.056438
C  -2.342584 -1.277083 -0.085625
C  -1.500958 1.000064 -0.022544
C  1.319029 -0.333156 -0.033492
C  -3.671531 -0.826103 -0.081744
C  -2.826267 1.477775 -0.017972
C  -3.895575 0.563789 -0.047567
C  3.6035 -0.658023 -0.017393
C  2.742707 1.475965 0.023087
H  0.138041 -1.966803 -0.085983
H  -0.648889 1.681889 -0.001711
H  -4.501341 -1.535934 -0.104549
H  -3.019435 2.553789 0.008582
H  4.528425 -2.505436 -0.051348
H  5.619538 -1.106192 -0.007563
H  2.11812 3.448215 0.059529
H  3.874604 3.201236 0.072515
