program: Gaussian 09
title: 000244078
version: EM64L-G09RevD.01
frameworkgroup: C1[X(C12H11NO)]
method: RPBEPBE
basis: SDD
operation: Freq
keyword: #p
keyword: freq=noraman
keyword: PBEPBE/SDD
title: #p freq=noraman PBEPBE/SDD
converged: YES YES NO NO
title: Mulliken charges:
elementType: O N C C C C C C C C C C C C H H H H H H H H H H H
charge: -0.299894 -0.146767 -0.596761 0.518828 0.196156 -0.123960 -0.362195 -0.436315 -0.324931 -0.255816 -0.228059 -0.222430 -0.144342 -0.237651 0.230078 0.277268 0.249135 0.275696 0.227417 0.250262 0.233413 0.228831 0.226247 0.235846 0.229944
chargesum: 0.00000
title: Mulliken charges with hydrogens summed into heavy atoms:
elementType: O N C C C C C C C C C C C C
charge: -0.299894 -0.146767 -0.089414 0.518828 0.196156 0.125175 -0.086499 -0.208898 -0.074669 -0.022403 0.000772 0.003817 0.091504 -0.007708
polarizability: 1.63421813e+02 -7.36947915e+00 1.36135930e+02 4.66413759e+00 -6.03772959e+00 9.39176478e+01
1716.lowfreq: -7.3461 -0.0010 -0.0008 -0.0006 2.3207 16.7641 26.0917 46.9768 60.4266
frequency: 25.3995 46.9152 60.3571 131.2009 200.7157 235.3517 269.0543 385.0602 403.6750 412.0832 445.4303 487.7598 517.4795 548.8669 576.4479 610.0059 617.8325 704.6335 711.4913 732.1147 754.9815 769.9060 818.4069 844.8958 857.2339 860.0245 921.7374 928.9487 952.2443 982.1652 985.0057 989.2360 1001.8512 1016.1718 1026.6873 1069.5422 1100.8599 1127.2310 1155.4789 1173.1877 1188.4927 1206.6191 1216.5397 1228.4959 1319.7602 1342.1769 1349.0628 1384.6329 1389.9781 1444.1561 1448.3641 1461.9571 1483.7904 1543.3892 1564.6495 1595.0428 1614.5894 1650.1811 3017.0653 3079.6014 3110.7678 3126.6029 3137.2163 3138.5133 3148.3132 3154.0370 3164.2846 3180.8051 3192.7672
redmass: 4.5044 4.6503 4.6526 5.0034 4.8606 5.3066 5.2800 2.0458 2.8233 3.6774 3.8560 4.8640 2.7497 5.6613 6.3631 4.8032 6.2059 2.4356 2.7665 2.1405 1.4922 2.8045 3.1896 1.5612 2.6922 1.5366 1.4702 1.4336 1.9767 1.3761 1.3094 6.1547 1.3285 2.3859 2.2415 2.1218 1.8466 1.5829 2.0473 1.0548 1.1148 1.3777 2.8179 1.4089 1.4584 1.4156 1.4032 3.7395 2.1245 2.1449 1.8620 1.3048 2.2662 6.8015 5.4495 6.1031 6.0576 6.9557 1.0590 1.1044 1.0882 1.0862 1.0915 1.0890 1.0963 1.0904 1.1015 1.0945 1.0999
irintensity: 1.9474 3.1344 0.4454 3.4314 1.3365 2.1850 0.9968 5.5961 0.1075 8.2729 1.4020 11.7634 14.1860 5.1271 6.9160 12.7761 0.4233 23.1498 36.9484 36.3508 85.3072 20.4127 5.2735 10.9081 8.5018 2.8969 0.7082 0.2525 5.6272 0.0919 0.4602 0.1448 0.4137 3.6923 7.0462 10.9300 7.8982 31.9085 22.2084 0.1529 1.9417 3.6130 6.0923 5.3130 21.7288 12.9821 15.1236 0.6738 16.4281 13.0834 5.4880 41.4417 18.2007 28.3332 177.8469 2.1711 4.5106 217.8479 31.0619 7.9778 11.9378 0.4512 12.5834 15.5769 24.8822 3.0005 26.1736 7.7044 7.3272
temp: 298.150 k
press: 1.00000 atm
elementType: 8 7 6 6 6 6 6 6 6 6 6 6 6 6 1 1 1 1 1 1 1 1 1 1 1
symmnumber: 1
zpe: 522406.4 jmol-1
zpe.correction: 0.198974 hartree
zpe.thermalcorrener: 0.210254 hartree
zpe.thermalcorrenthalpy: 0.211198 hartree
zpe.thermalcorrgfe: 0.160014 hartree
zpe.sumelectzpe: -592.873018 hartree
zpe.sumelectthermal: -592.861738 hartree
zpe.sumelectthermalent: -592.860794 hartree
zpe.sumelectthermalfe: -592.911978 hartree
dipole: 0.5620 -4.1207 -0.7237
dipole: 4.2213
quadrupole: -72.9827 -82.7119 -80.2990
quadrupole: 4.1793 2.8416 -5.8044
quadrupole: 5.6819 -4.0474 -1.6345 4.1793 2.8416 -5.8044
hfenergy: -593.0719916 hartree
pointgroup: C01 [X(C12H11N1O1)]
dipole: -0.1082594 -1.6221004 0.3395488 debye
dipolederiv: -0.6140805 0.2805585 -0.1332771 0.1698297 -1.0978455 0.2972344 -0.1288017 0.3325493 -0.4994262 -0.5886988 -0.2303529 -0.0122721 0.5619544 -0.5904321 0.3321837 -0.2582972 -0.0857629 -0.2744025 0.5896394 0.003757 0.0363601 -0.1868059 0.1024664 0.057255 0.2277112 0.0838609 0.3218795 0.1812201 0.0299424 -0.0887364 -0.0070136 -0.0145461 -0.0073026 -0.1831659 -0.0209043 -0.0867568 0.4895637 -0.3324451 0.2129888 -0.1897391 1.3041188 -0.3769392 0.1853522 -0.3928588 0.3453285 0.3605015 0.0727777 0.1839712 -0.606467 0.1149147 -0.2725047 0.3718868 0.0074131 0.1248967 -0.102792 0.0694636 0.0044416 0.0871237 -0.0400864 0.0294063 0.0577486 0.0136749 -0.1224412 -0.178735 -0.0097788 -0.05468 0.0359004 -0.0091956 0.1022058 -0.0191354 0.103242 -0.0565647 -0.1951786 0.4271392 -0.0795596 0.0391737 -0.2237102 0.0431361 -0.0068206 0.2776084 -0.2388585 -0.5042932 -0.2343006 -0.0445854 -0.0266325 -0.1586584 -0.0271532 -0.16148 -0.1758907 -0.2624936 -0.0733349 -0.0117545 -0.0584893 -0.0226397 0.0532316 0.1170705 -0.0672045 0.1305786 -0.0326443 -0.0108122 0.1137552 -0.0265038 0.1143846 0.0385673 0.0354801 -0.0119512 0.0421731 -0.1029787 0.1916323 0.093634 0.1500061 0.1855523 0.4385106 -0.0216767 0.1345293 -0.0179989 0.0219069 0.007714 0.0307089 -0.119408 0.0190966 -0.0868046 0.0279682 -0.1037746 0.0266571 -0.0665307 -0.0116001 -0.0025801 -0.0225086 0.0143328 -0.0261796 -0.1739222 -0.0184747 -0.0635677 0.0014198 0.0487315 -0.0184691 0.0582115 0.1049896 0.0560695 0.0981529 0.0128869 -0.0042325 0.0877282 0.0829061 -0.1005716 -0.0616133 -0.0784244 0.0057808 -0.0010282 -0.0526313 -0.0183203 0.1187264 0.110697 -0.0990523 0.0147438 -0.0869966 0.0414987 -0.0295408 -0.0102171 -0.0082279 0.1159296 0.0950483 0.0485643 0.0789149 0.029288 -0.0073446 -0.1123568 0.0615844 -0.1174879 0.0283885 0.0586765 -0.0403085 -0.0547407 -0.0804432 -0.0081614 -0.014828 -0.0569226 -0.0057879 0.1380693 0.0969412 0.0228032 -0.0542388 0.0299328 -0.0530077 0.0570746 -0.066535 0.0562636 0.1388307 0.0753839 0.0149564 0.0530746 0.0349302 -0.0175325 -0.1179952 0.0689738 -0.115365 0.0455352 0.0014659 -0.1153674 0.0148352 -0.1351341 -0.0280896 -0.0377861 0.0230293 -0.0395729 0.1226895 -0.0495129 0.006862 -0.1184586 0.0175087 0.1010062 0.0176092 -0.131594 0.0126527 0.0652754 -0.0610832 -0.0199416 0.1215237 -0.0237014 0.1054296 -0.0217431 0.1333035 -0.020696 0.0664931 unknown
polarizability: 162.2744039|9.3216305|137.6625323|3.9112277|4.8714265|93.5384538 unknown
InChI: InChI=1S/C12H11NO/c14-12-8-4-5-9-13(12)10-11-6-2-1-3-7-11/h1-9H,10H2
charge 0 multiplicity 1
25 atoms
O  1.433548 2.189395 -0.789361
N  1.179464 -0.150504 -0.615697
C  -0.054613 -0.059547 -1.456088
C  -1.338472 -0.106615 -0.638122
C  1.884345 1.083327 -0.341233
C  1.585568 -1.372457 -0.116493
C  -1.663342 0.96339 0.236483
C  -2.223672 -1.207371 -0.743057
C  3.088688 0.918316 0.459293
C  2.7263 -1.498879 0.661928
C  -2.851078 0.923659 0.997291
C  -3.416482 -1.245299 0.01634
C  3.490877 -0.318658 0.946604
C  -3.73106 -0.180432 0.890353
H  -0.028527 -0.884173 -2.190214
H  0.02875 0.90459 -1.987572
H  0.950853 -2.228114 -0.366295
H  -0.98431 1.821184 0.306129
H  -1.986012 -2.033454 -1.425927
H  3.651638 1.832753 0.665141
H  3.021801 -2.479889 1.03957
H  -3.095477 1.754334 1.668809
H  -4.096554 -2.099696 -0.075114
H  4.398565 -0.395933 1.555899
H  -4.654395 -0.207728 1.479832
