program: Gaussian 09
title: 000244087
version: EM64L-G09RevD.01
frameworkgroup: C1[X(C16H13NO4)]
method: RPBEPBE
basis: SDD
operation: Freq
keyword: #p
keyword: freq=noraman
keyword: PBEPBE/SDD
title: #p freq=noraman PBEPBE/SDD
converged: YES YES NO NO
title: Mulliken charges:
elementType: O O O O N C C C C C C C C C C C C C C C C H H H H H H H H H H H H H
charge: -0.269983 -0.269114 -0.273197 -0.247803 0.004541 0.092269 0.245569 0.078637 0.282695 0.127208 -0.419498 0.254068 -0.428526 -0.355485 0.335650 -0.305464 -0.300472 -0.356346 -0.345434 -0.517108 -0.533734 0.281223 0.250911 0.247896 0.229602 0.282027 0.244746 0.244873 0.258041 0.217589 0.235097 0.226837 0.249403 0.233281
chargesum: 0.00000
title: Mulliken charges with hydrogens summed into heavy atoms:
elementType: O O O O N C C C C C C C C C C C C C C C C
charge: -0.269983 -0.269114 -0.273197 -0.247803 0.004541 0.092269 0.245569 0.078637 0.282695 0.127208 -0.138275 0.254068 -0.177615 -0.107589 0.335650 -0.075862 -0.018445 -0.111600 -0.100561 0.193619 0.175787
polarizability: 3.11252302e+02 -8.47407455e+00 2.38438970e+02 2.65388373e+00 4.84260102e+00 8.62075422e+01
1716.lowfreq: -4.1586 -0.0006 0.0002 0.0003 3.9450 7.6135 30.5286 39.7051 61.4228
frequency: 30.5011 39.6786 61.4204 77.0301 80.3739 94.2551 125.0117 138.2375 158.6256 185.9383 197.4343 210.5335 232.1967 256.0744 276.5857 303.9673 309.6705 340.1015 366.3809 374.4704 390.5210 467.9591 474.8041 488.0846 548.1979 564.4960 583.2686 612.8943 644.1851 647.2086 661.4618 687.7873 703.7270 722.1259 744.0540 771.1983 815.0259 822.4025 837.7051 869.1289 890.9830 892.9343 911.6247 960.5877 966.1508 970.7197 990.1133 993.2476 1012.9227 1062.1014 1066.9559 1092.0403 1109.0527 1111.4907 1132.5436 1149.5316 1158.3820 1191.9867 1202.0928 1224.6070 1250.9866 1262.1810 1280.3726 1297.5603 1325.2854 1344.2800 1390.4618 1404.2195 1406.8616 1430.4050 1442.0436 1456.2071 1464.6789 1468.7148 1471.0766 1478.6601 1488.6756 1540.4681 1552.8768 1563.2489 1587.1917 1607.2976 1621.3228 2971.8067 2981.9901 3066.0234 3089.9184 3132.0079 3132.4879 3136.8271 3140.2800 3155.1539 3165.6742 3173.8939 3182.6428 3186.5107
redmass: 3.6689 4.5773 2.5850 4.1189 4.3075 3.9649 4.3298 2.5066 2.0849 3.7807 5.5498 4.4657 1.3043 6.4934 5.1065 6.7346 4.4743 5.0495 2.4972 5.3738 6.5771 5.4739 6.0744 9.0423 5.1120 6.3830 5.9855 7.1014 4.7631 4.7016 6.9658 5.7115 2.9257 7.4078 3.1776 5.5281 6.8568 1.4795 1.5259 1.6884 5.9249 1.3360 6.9511 7.0633 1.3331 1.4267 1.4348 8.3647 4.6020 3.0926 2.9808 1.6458 1.2321 1.2555 1.8153 1.3905 1.6836 1.8703 2.8683 1.2796 1.9854 3.1819 2.9694 5.7170 2.4768 2.1505 6.5863 2.1762 2.7319 1.3005 1.3264 1.0770 2.0008 1.0515 1.1369 1.0558 2.7673 7.8180 8.6868 7.9719 5.8375 8.0353 7.7452 1.0323 1.0329 1.1047 1.1000 1.1040 1.1008 1.0879 1.0913 1.0874 1.0964 1.0963 1.0958 1.0916
irintensity: 0.4578 0.9513 3.8289 1.6482 0.7864 3.0368 8.4101 6.0221 1.1811 6.4753 0.4746 6.3882 0.7687 0.2212 4.1749 2.3445 1.6870 1.5416 0.0453 3.5243 1.1642 15.9411 13.1128 0.8672 6.2065 3.8694 1.2745 15.2016 7.8658 8.9262 0.7892 0.3310 7.6754 15.8522 0.8298 3.8242 5.8602 61.3715 49.7838 21.3405 8.9354 0.4659 6.1926 3.0996 1.1472 0.3799 1.4040 32.3001 59.9288 136.3736 91.1082 6.9989 7.1614 0.1669 29.8539 8.0825 31.2922 55.0884 40.8743 6.8092 35.1752 145.5535 16.2131 30.2641 150.5922 255.4131 33.2418 91.7311 11.9579 0.8020 12.4935 12.7337 14.5129 15.2949 66.1690 19.6381 28.5852 14.3416 213.4284 22.9877 72.5094 153.8113 134.7914 71.0309 69.5002 37.4012 32.9401 12.1360 19.4005 19.3717 16.7394 1.7075 12.9034 11.7719 2.7956 3.7845
temp: 298.150 k
press: 1.00000 atm
elementType: 8 8 8 8 7 6 6 6 6 6 6 6 6 6 6 6 6 6 6 6 6 1 1 1 1 1 1 1 1 1 1 1 1 1
symmnumber: 1
zpe: 667845.7 jmol-1
zpe.correction: 0.254369 hartree
zpe.thermalcorrener: 0.272764 hartree
zpe.thermalcorrenthalpy: 0.273709 hartree
zpe.thermalcorrgfe: 0.206908 hartree
zpe.sumelectzpe: -971.620835 hartree
zpe.sumelectthermal: -971.602440 hartree
zpe.sumelectthermalent: -971.601496 hartree
zpe.sumelectthermalfe: -971.668296 hartree
dipole: -5.4445 -2.7541 1.1242
dipole: 6.2041
quadrupole: -99.8569 -131.9465 -123.9139
quadrupole: 12.7604 -0.2176 -3.6644
quadrupole: 18.7156 -13.3740 -5.3415 12.7604 -0.2176 -3.6644
hfenergy: -971.8752042 hartree
pointgroup: C01 [X(C16H13N1O4)]
dipole: -2.0840657 -1.181578 0.4674507 debye
polarizability: 311.9118073|-4.9749994|237.8292441|0.0291414|4.6420832|86.1577626 unknown
InChI: InChI=1S/C16H13NO4/c1-19-13-4-3-11-12(18)9-14(10-5-7-17-8-6-10)21-15(11)16(13)20-2/h3-9H,1-2H3
charge 0 multiplicity 1
34 atoms
O  0.471114 -0.226779 0.018054
O  -1.398432 -2.152215 -0.149561
O  -4.13922 -1.496923 -0.067737
O  -0.404094 3.857661 0.167852
N  5.399223 -1.167394 -0.102502
C  -0.868514 0.194436 0.034723
C  -1.214844 1.571472 0.087519
C  -1.843029 -0.83609 -0.00234
C  1.494109 0.730977 0.035279
C  -0.150388 2.607346 0.116833
C  -2.586034 1.917443 0.11258
C  -3.215921 -0.448669 0.009225
C  1.218009 2.079536 0.079831
C  -3.577187 0.925977 0.077901
C  2.828341 0.093394 -0.006866
C  4.024263 0.848916 0.124781
C  2.952933 -1.310972 -0.184955
C  5.265915 0.183408 0.070557
C  4.241726 -1.884674 -0.22599
C  -1.866464 -3.14734 0.843263
C  -5.565285 -1.153082 -0.140832
H  -2.839441 2.981057 0.157142
H  2.030924 2.808916 0.08258
H  -4.631212 1.216748 0.091325
H  4.003387 1.93241 0.273802
H  2.059629 -1.931331 -0.291082
H  6.201734 0.744291 0.170342
H  4.365093 -2.96443 -0.364593
H  -2.961363 -3.262159 0.796549
H  -1.553105 -2.847856 1.861291
H  -1.365335 -4.083689 0.556294
H  -5.90079 -0.634475 0.777124
H  -6.083383 -2.118296 -0.233847
H  -5.777061 -0.526912 -1.027543
