program: Gaussian 09
title: 000244067
version: EM64L-G09RevD.01
frameworkgroup: C1[X(C10H10N2S)]
method: RPBEPBE
basis: SDD
operation: Freq
keyword: #p
keyword: freq=noraman
keyword: PBEPBE/SDD
title: #p freq=noraman PBEPBE/SDD
converged: NO YES NO NO
title: Mulliken charges:
elementType: S N N C C C C C C C C C C H H H H H H H H H H
charge: 0.209398 -0.070511 -0.573643 -0.422840 0.349266 0.342664 -0.377896 -0.378095 -0.776032 -0.187769 -0.216615 -0.216631 -0.238523 0.248409 0.248387 0.235596 0.246587 0.235577 0.227618 0.227618 0.229268 0.325368 0.332801
chargesum: 0.00000
title: Mulliken charges with hydrogens summed into heavy atoms:
elementType: S N N C C C C C C C C C C
charge: 0.209398 -0.070511 0.084527 -0.422840 0.349266 0.342664 -0.129488 -0.129708 -0.058272 -0.187769 0.011002 0.010987 -0.009255
polarizability: 2.01438171e+02 -2.24327796e-01 1.06925196e+02 -7.73095135e-03 8.29890672e-02 9.96106629e+01
1716.lowfreq: -125.4549 -43.2931 -6.8526 -5.7697 -0.0032 -0.0027 -0.0007 5.9479 63.8591
frequency: -125.4547 -43.2840 63.8070 71.0902 181.3283 206.3800 228.3463 244.4806 272.4830 309.1127 387.7693 400.8623 401.5669 441.3506 498.7107 535.9260 577.7190 582.0582 597.4579 609.4286 631.7358 668.9781 704.2650 763.7447 855.0939 875.8726 926.5468 933.7024 979.4287 987.7451 997.0542 1013.3503 1032.5098 1040.8903 1073.2219 1073.3751 1171.3633 1183.7128 1248.4567 1266.3668 1305.5096 1318.4468 1365.5387 1392.6062 1427.2987 1462.7749 1467.7747 1476.0524 1560.6017 1570.8385 1579.7881 1611.7020 1620.5195 2990.8079 3069.0402 3113.5723 3122.5540 3129.8617 3141.9893 3150.8321 3164.5212 3558.9725 3712.7503
redmass: 1.0181 4.1820 5.1591 4.7784 4.7609 4.9586 3.4263 4.7907 1.1765 4.2996 1.4709 4.2043 2.8333 2.4805 5.1118 5.1355 6.3958 4.0857 6.7490 6.8417 6.1238 6.1367 1.7444 1.9379 1.2418 3.5645 2.5557 1.7677 1.3842 6.1084 1.3248 2.4927 1.8520 1.4525 2.1094 1.5990 1.0543 1.1111 3.3600 3.8449 1.3832 6.0882 6.5859 1.2547 2.2055 1.3584 1.0464 1.6228 3.4223 3.7008 5.9470 6.4954 1.8070 1.0373 1.0980 1.0988 1.0844 1.0878 1.0926 1.0969 1.1018 1.0448 1.1047
irintensity: 0.1426 0.0832 2.4967 1.0673 0.0040 6.1634 1.3583 0.4305 107.1539 4.6391 175.9556 0.0793 0.0141 53.7134 1.5409 18.1309 1.0906 6.7730 24.8307 3.6554 2.0210 5.2934 51.3786 56.9377 0.0165 9.0860 21.0545 8.9318 0.0040 1.5526 0.1259 1.9572 3.2193 3.1256 1.1817 10.4795 0.0005 2.3724 102.6898 57.9678 0.0934 20.1171 0.2143 23.1042 6.6709 7.6112 18.8822 21.6527 91.3288 11.6145 1.5145 4.4018 423.2332 24.2669 16.8687 14.3420 1.2267 1.4577 20.1631 36.0878 22.3065 112.8290 44.8518
temp: 298.150 k
press: 1.00000 atm
elementType: 16 7 7 6 6 6 6 6 6 6 6 6 6 1 1 1 1 1 1 1 1 1 1
symmnumber: 1
zpe: 462665.6 jmol-1
zpe.correction: 0.176220 hartree
zpe.thermalcorrener: 0.187060 hartree
zpe.thermalcorrenthalpy: 0.188005 hartree
zpe.thermalcorrgfe: 0.139354 hartree
zpe.sumelectzpe: -893.703380 hartree
zpe.sumelectthermal: -893.692539 hartree
zpe.sumelectthermalent: -893.691595 hartree
zpe.sumelectthermalfe: -893.740245 hartree
dipole: 0.6245 -0.9727 0.0025
dipole: 1.1559
quadrupole: -61.7454 -84.5755 -80.6478
quadrupole: -7.4235 0.0166 0.0278
quadrupole: 13.9108 -8.9193 -4.9915 -7.4235 0.0166 0.0278
hfenergy: -893.8795998 hartree
pointgroup: C01 [X(C10H10N2S1)]
dipole: 0.2177311 0.3992608 -0.000179 debye
dipolederiv: -0.5992228 0.0376569 0.0000764 0.226176 -0.4325109 -0.0000868 0.0004833 -0.0002124 0.0572932 -0.8830165 -0.0579812 0.000058 -0.452324 -1.016811 -0.0000808 0.0004247 -0.000183 -0.2394763 -1.573865 -0.4828986 -0.0001806 -0.4846395 -0.4037564 -0.0000562 -0.0007315 -0.0001996 -0.7129216 0.2867682 0.1557407 -0.0000197 0.3885996 0.1976999 -0.0000821 -0.0002389 0.0001761 -0.2299589 0.3128814 -0.0224002 -0.0000838 -0.0190809 -0.0957683 0.0001161 0.0000707 0.0000013 0.0522359 0.502492 0.1326728 -0.0000969 -0.033982 0.3772284 0.0000332 -0.0007981 0.0000551 0.0093954 -0.1509106 0.0044217 0.0919172 0.0030278 -0.1171473 -0.0013065 -0.0028026 -0.0008269 0.0452132 -0.1509073 0.0040519 -0.0918183 0.0023918 -0.1171752 0.0020214 0.0028652 0.0014229 0.0452235 0.0484154 -0.0421874 0.0000148 -0.065454 -0.0932175 -0.0000396 0.0001721 -0.0001681 0.0688535 1.754076 0.1867199 0.0001249 0.3589022 0.9963518 0.0002457 0.0003671 0.0003574 0.0850469 -0.0541447 -0.000995 -0.1036824 0.0013 -0.1464731 -0.0006002 -0.0876538 -0.0049472 0.0729852 -0.054227 -0.0005298 0.1036989 0.0012864 -0.1463873 0.0015846 0.0877582 0.0058892 0.0728884 0.0873282 -0.0022552 -0.000015 -0.0024241 -0.1617959 0.0002674 -0.0000898 0.0003163 -0.0410192 0.0607322 -0.0025084 -0.0938717 -0.0016753 0.1340455 0.0035698 -0.089892 0.003648 -0.0334083 0.0607406 -0.0021008 0.0938776 -0.0011986 0.1340191 -0.0043683 0.0898821 -0.0043323 -0.0334541 0.0419108 -0.0681823 -0.1049103 -0.0257239 0.0313339 0.0018271 -0.1044276 -0.0674817 -0.0400124 -0.0456702 0.1450941 -0.0000615 0.0616914 0.0165229 0.0000271 -0.0001232 0.000098 0.1222263 0.0417754 -0.0682442 0.1049288 -0.0258108 0.0313722 -0.0018489 0.1044223 0.0674555 -0.0398415 -0.0027896 0.0037005 0.0883073 0.0005093 0.1549344 -0.0006248 0.1114398 -0.0022511 -0.0734914 -0.0028469 0.0033188 -0.088329 0.0000806 0.154942 -0.0004044 -0.1114518 0.0012584 -0.0734454 -0.1485612 0.0037899 0.0000225 0.0010476 0.1593527 -0.0001668 0.0000236 -0.0001511 0.0883561 0.2267032 0.060026 0.0000079 0.1016746 0.1882393 0.000021 0.0002597 0.0001305 0.3997583 0.2423384 0.0130899 0.0000351 -0.0343742 0.1550007 -0.000048 0.0000404 -0.0000552 0.397553 unknown
polarizability: 200.9237192|6.9576078|107.4392533|-0.0040605|0.098842|99.6110577 unknown
InChI: InChI=1S/C10H10N2S/c1-7-9(13-10(11)12-7)8-5-3-2-4-6-8/h2-6H,11H2,1H3
charge 0 multiplicity 1
23 atoms
S  1.503052 1.659053 0.000473
N  2.760874 -0.710612 -0.000238
N  4.264399 1.151499 0.000327
C  0.526408 0.100725 0.000185
C  -0.957242 0.135174 0.000356
C  1.37881 -0.994645 -0.000208
C  -1.682802 0.14843 1.222983
C  -1.683119 0.143077 -1.222128
C  0.935689 -2.440652 -0.00045
C  3.004858 0.591169 0.000133
C  -3.095721 0.160057 1.223603
C  -3.096042 0.154659 -1.222433
C  -3.806466 0.162939 0.000664
H  -1.129615 0.148737 2.168984
H  -1.130175 0.139328 -2.168265
H  0.324809 -2.679354 -0.88959
H  1.826033 -3.088776 -0.000003
H  0.323875 -2.679326 0.888052
H  -3.640328 0.167889 2.174626
H  -3.640895 0.15833 -2.173339
H  -4.902401 0.173589 0.000784
H  4.40859 2.156022 0.000138
H  5.063206 0.521288 0.000048
