program: Gaussian 09
title: 000244074
version: EM64L-G09RevD.01
frameworkgroup: C1[X(C9H18ClNO)]
method: RPBEPBE
basis: SDD
operation: Freq
keyword: #p
keyword: freq=noraman
keyword: PBEPBE/SDD
title: #p freq=noraman PBEPBE/SDD
converged: YES YES NO NO
title: Mulliken charges:
elementType: Cl O N C C C C C C C C C H H H H H H H H H H H H H H H H H H
charge: -0.090506 -0.269054 -0.366859 -0.411545 -0.031301 -0.353337 -0.349205 -0.357890 -0.698607 -0.695223 0.281686 -0.662017 0.192334 0.202301 0.248246 0.197355 0.201328 0.187049 0.186773 0.197483 0.196601 0.217647 0.237824 0.203639 0.311554 0.209536 0.217190 0.209669 0.294070 0.293258
chargesum: 0.00000
title: Mulliken charges with hydrogens summed into heavy atoms:
elementType: Cl O N C C C C C C C C C
charge: -0.090506 -0.269054 -0.055305 -0.016909 0.216945 0.045346 0.024617 0.036194 -0.039497 -0.058828 0.281686 -0.074689
polarizability: 1.23354731e+02 3.85334573e+00 1.15483709e+02 -5.73587637e+00 3.14104036e+00 1.12075416e+02
1716.lowfreq: -16.4183 -4.1464 -0.0008 -0.0001 0.0016 8.4918 13.9461 20.1311 29.6460
frequency: 11.9798 15.1487 29.4252 67.6031 89.4848 100.7435 111.0790 121.3814 147.8723 193.2966 212.0880 231.2205 251.6879 281.3612 336.9321 387.7896 414.7103 461.1984 490.4191 568.9194 585.1119 658.7558 669.5966 722.2231 748.1035 822.8806 865.5271 890.0055 906.1465 912.9960 942.6911 964.1120 1009.5200 1023.6630 1061.5017 1069.5556 1089.5512 1124.1058 1147.6753 1156.3746 1158.9045 1201.0306 1236.3908 1245.0930 1253.1681 1267.0564 1286.2767 1291.8913 1295.0507 1326.8022 1345.9419 1353.0654 1357.2415 1386.8193 1387.7440 1419.1220 1456.8720 1462.9349 1468.6645 1470.3694 1474.7408 1477.2283 1479.5739 1487.1407 1509.0855 1606.8869 2950.5126 2953.7603 2964.7059 2971.1422 2971.9307 2979.7370 2990.2382 3006.7008 3019.6062 3028.5886 3043.2858 3068.3564 3071.5734 3071.8864 3077.0921 3091.8635 3154.3634 3492.3479
redmass: 2.8913 3.3710 3.5209 2.9133 2.9482 3.1922 2.0287 3.6155 2.2725 3.7514 1.1148 1.1138 3.8709 3.2706 4.0397 4.4363 3.1780 2.6637 2.8420 3.6081 3.8755 1.1698 5.8367 1.0731 1.1558 1.3489 1.9577 2.0527 1.7178 1.9724 1.3331 2.7221 2.9232 1.4320 3.0091 2.1837 2.2152 2.5527 1.1532 2.3061 2.0643 1.5537 1.4033 1.5008 1.1919 1.4591 1.0459 1.2541 1.1905 1.3637 1.4119 1.5120 1.5745 1.2165 1.2186 1.0921 1.0905 1.0692 1.0691 1.0942 1.0482 1.0430 1.0794 1.0884 1.8213 9.4814 1.0595 1.0623 1.0595 1.0551 1.0403 1.0365 1.0977 1.0960 1.0968 1.0933 1.1026 1.1008 1.0991 1.0566 1.0988 1.1001 1.1094 1.0770
irintensity: 1.3932 0.6328 0.6718 2.4619 10.2218 1.5153 2.0966 1.9085 0.7908 4.1402 1.8138 0.0011 7.7918 5.3569 0.4297 3.6988 6.2718 1.1525 2.0505 6.6989 6.4609 112.7554 71.1074 13.3591 0.9457 6.6169 2.5214 4.0364 8.7786 1.7386 1.4355 2.3623 1.4580 3.2566 2.7068 3.1295 1.6515 18.0574 0.6946 35.9537 5.3311 0.6699 6.7509 6.8806 18.8498 11.6197 1.5913 3.4762 6.0970 2.0272 7.9769 1.2519 2.0280 14.4211 12.0377 32.6838 9.3814 0.3565 12.3690 24.7392 11.0167 11.6427 11.7692 25.5360 181.2054 234.6287 1.9899 21.9410 0.8280 123.2931 23.3477 29.2528 1.4487 3.6793 2.9687 4.5960 78.9903 90.3713 50.2460 5.0533 48.1269 31.2671 1.3471 37.0412
temp: 298.150 k
press: 1.00000 atm
elementType: 17 8 7 6 6 6 6 6 6 6 6 6 1 1 1 1 1 1 1 1 1 1 1 1 1 1 1 1 1 1
symmnumber: 1
zpe: 678924.0 jmol-1
zpe.correction: 0.258588 hartree
zpe.thermalcorrener: 0.274138 hartree
zpe.thermalcorrenthalpy: 0.275083 hartree
zpe.thermalcorrgfe: 0.211574 hartree
zpe.sumelectzpe: -942.826711 hartree
zpe.sumelectthermal: -942.811161 hartree
zpe.sumelectthermalent: -942.810216 hartree
zpe.sumelectthermalfe: -942.873725 hartree
dipole: 1.3962 0.4536 -1.9275
dipole: 2.4229
quadrupole: -83.4248 -81.6766 -88.7434
quadrupole: 1.6719 2.5584 -5.8702
quadrupole: 1.1901 2.9383 -4.1285 1.6719 2.5584 -5.8702
hfenergy: -943.085299 hartree
pointgroup: C01 [X(C9H18Cl1N1O1)]
dipole: -0.5730259 -0.4717773 -0.5980976 debye
polarizability: 123.2612537|5.9609186|113.6634124|3.4539108|-3.7307806|113.9891896 unknown
InChI: InChI=1S/C9H18ClNO/c1-3-4-5-6-8(2)11-9(12)7-10/h8,11H,3-7H2,1-2H3
charge 0 multiplicity 1
30 atoms
Cl 2.543027 1.904263 -2.139867
O  2.27077 0.479225 1.6760
N  1.319167 -0.228989 -0.345203
C  -0.892079 -1.368888 -0.27046
C  0.580521 -1.387552 0.209868
C  -1.692669 -0.134725 0.198284
C  -3.164866 -0.15791 -0.270658
C  -3.970359 1.07726 0.192789
C  1.297196 -2.707614 -0.156202
C  -5.444169 1.042197 -0.266055
C  2.097256 0.593971 0.420048
C  2.822009 1.756603 -0.26296
H  -0.917146 -1.436326 -1.379739
H  -1.381094 -2.290213 0.104442
H  0.61074 -1.254596 1.307668
H  -1.660494 -0.078408 1.305949
H  -1.202714 0.787939 -0.172811
H  -3.199075 -0.220732 -1.378885
H  -3.658732 -1.077795 0.107404
H  -3.928035 1.145298 1.298986
H  -3.482781 1.995555 -0.193329
H  0.779623 -3.567137 0.30707
H  2.340311 -2.697393 0.20437
H  1.30812 -2.866134 -1.251233
H  1.269618 -0.0450 -1.352855
H  -5.51585 1.002519 -1.369583
H  -5.99655 1.936547 0.076121
H  -5.962962 0.150922 0.135055
H  2.479933 2.70918 0.166836
H  3.907884 1.647333 -0.129151
