program: Gaussian 09
title: 000244056
version: EM64L-G09RevD.01
frameworkgroup: C1[X(C5H4F3N3)]
method: RPBEPBE
basis: SDD
operation: Freq
keyword: #pfreq=noraman
keyword: PBEPBE/SDD
title: #p freq=noraman PBEPBE/SDD
converged: YES YES NO NO
title: Mulliken charges:
elementType: F F F N N N C C C C C H H H H
charge: -0.136789 -0.160000 -0.159292 -0.034483 -0.010094 -0.618709 -0.096641 0.350042 0.238922 -0.282359 -0.251160 0.232820 0.255776 0.345986 0.325983
chargesum: 0.00000
title: Mulliken charges with hydrogens summed into heavy atoms:
elementType: F F F N N N C C C C C
charge: -0.136789 -0.160000 -0.159292 -0.034483 -0.010094 0.053260 -0.096641 0.350042 0.238922 -0.049539 0.004616
polarizability: 9.52651669e+01 7.44456368e+00 8.63360338e+01 -2.44125327e-02 -1.38242721e-03 3.86447658e+01
1716.lowfreq: -10.2615 -0.0008 -0.0007 0.0001 1.6723 5.4167 15.8110 110.1545 161.0465
frequency: 10.6802 110.1483 161.0443 187.8093 292.3481 307.1497 327.6642 409.4137 428.0724 457.0318 485.5178 516.7565 545.4189 559.3162 630.5122 685.1769 713.2106 787.1694 844.9318 893.6399 927.0610 976.9393 1004.4845 1014.6478 1033.4369 1089.2099 1131.0000 1269.2422 1314.3841 1363.4973 1392.5390 1447.3928 1523.4245 1578.8914 1630.1867 3149.4324 3172.2450 3542.2981 3696.5676
redmass: 9.4365 7.3588 8.2322 5.3018 9.4359 7.8052 9.6778 4.1658 4.6330 1.1461 4.2201 9.5026 8.0528 1.2532 14.1400 5.1046 8.7607 4.4433 1.6806 5.0364 8.9240 1.4158 12.1142 2.0113 5.7525 2.5768 2.4409 2.7289 3.1148 2.6162 5.0381 4.0502 5.2842 2.8424 1.6302 1.0891 1.0990 1.0457 1.1045
irintensity: 0.3651 2.1196 1.7981 0.9271 2.4754 3.5741 1.3118 3.7749 1.2742 114.6158 57.0642 0.5041 7.9490 149.4574 23.1193 0.1674 6.9544 0.5839 63.6048 40.5845 5.2784 2.0894 233.7725 67.4720 155.8789 83.2940 98.6634 82.5250 21.6634 17.9993 12.5885 54.8077 34.5824 136.7448 427.4691 5.7493 17.3517 105.2673 44.7455
temp: 298.150 k
press: 1.00000 atm
elementType: 9 9 9 7 7 7 6 6 6 6 6 1 1 1 1
symmnumber: 1
zpe: 248882.4 jmol-1
zpe.correction: 0.094794 hartree
zpe.thermalcorrener: 0.104230 hartree
zpe.thermalcorrenthalpy: 0.105174 hartree
zpe.thermalcorrgfe: 0.058299 hartree
zpe.sumelectzpe: -655.908393 hartree
zpe.sumelectthermal: -655.898957 hartree
zpe.sumelectthermalent: -655.898013 hartree
zpe.sumelectthermalfe: -655.944888 hartree
dipole: -7.7582 -0.6033 -0.0101
dipole: 7.7816
quadrupole: -47.4208 -58.4154 -64.6263
quadrupole: 2.6543 -0.0021 0.0122
quadrupole: 9.4000 -1.5946 -7.8055 2.6543 -0.0021 0.0122
hfenergy: -656.0031871 hartree
pointgroup: C01 [X(C5H4F3N3)]
dipole: -3.0565731 -0.156141 -0.0762564 debye
dipolederiv: -0.6550606 -0.2767839 0.01232 -0.1851879 -0.5449697 0.01702 0.0044223 0.0146158 -0.2754244 -0.5088703 0.107183 -0.1309701 0.1457465 -0.4132099 0.2401607 -0.1090564 0.2024856 -0.6815685 -0.5151996 0.1344916 0.1195834 0.1705128 -0.4797203 -0.2606379 0.090789 -0.2233796 -0.6018543 -0.8871767 -0.5146836 0.008233 -0.0386367 -0.4938599 0.0145753 -0.0161939 0.0036606 -0.1846763 -0.6847603 0.0733396 -0.0166955 0.1816387 -0.6296985 0.0286223 -0.0223259 0.0249596 -0.1786498 -0.7226039 -0.6534636 0.0344691 -0.7070285 -0.8891216 -0.0082639 0.0386434 -0.0054774 -0.7058744 0.4239716 0.1573085 0.0049785 -0.0782138 0.5921303 -0.036227 0.0215677 -0.0313995 -0.0609282 1.7743727 0.0021962 0.003729 -0.0989595 1.400834 0.0055181 0.0110949 0.0074918 1.5435321 0.9685165 0.7718734 -0.0217359 0.8870874 1.0830654 -0.0217673 -0.028301 -0.0249043 0.2304668 -0.1263575 -0.0450962 0.002311 -0.4426682 -0.5644537 0.0110769 0.0230661 0.0211154 -0.1358265 0.5487085 0.0490272 0.0120092 -0.0262591 0.4690017 -0.0267261 0.0154726 -0.0246014 -0.030554 -0.088101 0.0502068 -0.0092666 0.0259417 0.0830158 0.0053733 -0.0079416 0.005991 0.173741 0.0737495 0.0540541 -0.004211 0.0749297 -0.0584348 0.0116996 -0.0052283 0.0111478 0.1308227 0.1722292 0.0129565 -0.0061024 0.0465735 0.2734975 0.006759 -0.008226 0.0053792 0.3840142 0.2265818 0.0773906 -0.0086517 0.0445236 0.1719238 0.012817 -0.007783 0.0129154 0.3927796 unknown
polarizability: 95.6359987|7.2478971|85.8191744|1.0972449|-2.2641135|38.7907934 unknown
InChI: InChI=1S/C5H4F3N3/c6-5(7,8)4-10-2-1-3(9)11-4/h1-2H,9H2
charge 0 multiplicity 1
15 atoms
F  2.627332 0.830992 0.022379
F  1.993127 -0.942902 1.276905
F  2.043757 -1.109038 -0.986872
N  -0.631011 -0.814524 0.046748
N  0.01378 1.538351 -0.058166
N  -2.860404 -1.500418 0.026903
C  0.26122 0.206174 0.01677
C  1.721894 -0.234612 0.080111
C  -1.959114 -0.466496 -0.004566
C  -2.347944 0.910154 -0.085474
C  -1.32237 1.864864 -0.108777
H  -3.398863 1.210209 -0.127531
H  -1.550013 2.933874 -0.16944
H  -2.498547 -2.451301 0.084627
H  -3.863346 -1.340326 -0.009316
