program: Gaussian 09
title: 000244124
version: EM64L-G09RevD.01
frameworkgroup: C1[X(C20H23N7O6)]
method: RPBEPBE
basis: SDD
operation: Freq
keyword: #p
keyword: freq=noraman
keyword: PBEPBE/SDD
title: #p freq=noraman PBEPBE/SDD
converged: YES YES NO NO
title: Mulliken charges:
elementType: O O O O O O N N N N N N N C C C C C C C C C C C C C C C C C C C C H H H H H H H H H H H H H H H H H H H H H H H
charge: -0.309282 -0.289691 -0.204789 -0.216622 -0.202623 -0.214298 -0.088991 -0.176375 -0.410620 -0.506085 -0.500120 0.017500 0.018102 -0.353951 -0.345545 -0.376249 -0.394549 -0.318500 -0.395537 0.293708 0.525421 0.286340 -0.600056 -0.344593 0.426450 0.531266 -0.170692 -0.394197 -0.598386 -0.352607 0.427039 -0.169567 -0.392575 0.207610 0.223459 0.216297 0.190294 0.264442 0.222757 0.233119 0.187551 0.226839 0.195276 0.237076 0.255389 0.290464 0.305690 0.275203 0.322714 0.299475 0.238132 0.285954 0.277385 0.318844 0.239432 0.287272
chargesum: 0.00000
title: Mulliken charges with hydrogens summed into heavy atoms:
elementType: O O O O O O N N N N N N N C C C C C C C C C C C C C C C C C C C C
charge: -0.309282 -0.289691 -0.204789 -0.216622 -0.202623 -0.214298 -0.088991 -0.176375 -0.120156 -0.200395 -0.200645 0.017500 0.018102 0.077118 0.061046 0.110950 0.026121 0.103615 0.096928 0.293708 0.525421 0.286340 -0.324854 -0.021878 0.426450 0.531266 0.067440 -0.108243 -0.321002 -0.033763 0.427039 0.069865 -0.105303
polarizability: 4.81344840e+02 -1.55891279e+00 3.00618779e+02 5.88129509e+00 8.49031572e+00 1.78025813e+02
1716.lowfreq: -8.7629 -0.0016 0.0003 0.0013 1.9615 2.2560 5.0028 8.3966 10.8926
frequency: 4.9239 8.2825 10.8121 18.7609 26.3804 35.7135 48.7744 53.2362 62.5149 65.8605 76.8660 77.7091 85.1705 87.2530 118.4279 163.3582 169.1800 170.7952 189.5059 197.6740 217.5926 228.4760 232.8800 247.8883 251.9362 295.7728 309.1943 319.5525 321.2436 340.0825 354.6563 376.6610 401.8731 402.4154 405.3760 413.8035 427.0663 427.1032 469.1126 483.2694 514.2532 518.3015 521.4012 533.3679 569.0527 576.7513 594.8639 597.7500 626.2800 638.3639 654.5333 666.6179 681.7220 682.0249 696.7287 704.3599 705.0162 707.5423 708.5686 758.7253 770.1980 775.4321 795.6473 816.9881 818.1459 836.7673 841.3461 887.7016 891.1662 907.3448 909.3299 947.0266 947.7278 948.2768 963.1399 981.8781 984.9322 991.3000 1001.4987 1006.6421 1007.4982 1045.7853 1050.5240 1069.8535 1083.0031 1083.5675 1086.2644 1089.9993 1090.6734 1101.5489 1110.9539 1143.0217 1152.1648 1174.3370 1175.6066 1184.7275 1203.1437 1213.3161 1216.1553 1220.8396 1234.6041 1245.8310 1258.0584 1262.6011 1280.5398 1294.5869 1303.6919 1307.9161 1309.4931 1325.2209 1342.9482 1352.0957 1359.4210 1367.6489 1368.7672 1372.1982 1378.0231 1381.8097 1393.9710 1404.1793 1433.8345 1436.9016 1446.0935 1451.6665 1456.9386 1462.1321 1465.9418 1478.9495 1482.3922 1485.9099 1489.4163 1510.1198 1514.6053 1586.8745 1590.9603 1615.3776 1623.9285 1625.7087 1646.6890 2860.5367 2882.8315 2906.6556 2969.1417 2979.9543 3020.1461 3026.6696 3035.7142 3060.0496 3065.0389 3095.2520 3100.1422 3151.5295 3151.7091 3153.1684 3154.1467 3191.4857 3191.6849 3196.6748 3197.4287 3528.1044 3554.7597 3555.4704
redmass: 7.3210 7.0702 6.6546 6.3390 4.3584 5.4938 6.5564 7.3869 9.1294 6.9911 4.7754 7.0451 5.8499 6.1619 4.2147 4.3998 5.4529 5.1669 4.7280 5.3880 4.1143 2.5221 3.0362 4.2828 3.2720 3.2804 3.2033 2.7836 5.8932 4.3283 2.5552 2.1120 7.2625 6.7194 4.8754 2.5486 3.3330 3.3537 2.7202 5.3521 5.7515 6.3402 2.4647 3.4910 2.1002 3.3309 1.3356 3.8830 5.2724 3.4570 6.0239 5.7721 2.4038 2.3974 8.9142 7.0065 3.2486 6.0091 7.2254 7.1350 6.6440 2.8389 1.9844 1.3774 1.3798 1.9621 3.3619 4.8411 4.8466 1.6345 1.6291 1.3667 1.3622 2.3370 4.1603 5.2224 6.2168 2.7471 3.2823 1.3331 1.3318 2.3805 2.4193 2.3717 1.8025 1.7659 2.0283 1.6587 1.7045 2.5866 3.7966 2.6299 2.6669 1.1539 1.1544 1.7823 1.1438 3.9345 6.8938 2.6295 1.8524 1.7657 1.7669 1.8965 1.3487 1.4063 1.4259 1.7364 1.3708 1.2979 1.2647 1.3215 2.4323 4.5345 1.5839 2.2699 2.6211 4.8788 1.4887 2.7527 3.7802 4.0502 1.1470 1.1091 1.0839 1.1032 1.1033 1.1084 2.0258 2.8548 2.1807 2.3049 2.3942 7.0554 6.0351 4.0081 6.3473 7.3056 4.4218 1.0704 1.0706 1.0677 1.0652 1.0678 1.0917 1.0606 1.0896 1.0904 1.0958 1.1048 1.0945 1.0914 1.0918 1.0901 1.0898 1.0930 1.0933 1.0973 1.0968 1.0764 1.0777 1.0752
irintensity: 0.8048 0.6893 0.2725 1.1398 1.6728 0.7091 0.1821 3.1780 9.1215 0.3907 4.5606 0.4226 10.8749 4.6205 6.9708 3.1571 0.2727 0.5661 2.0656 1.2010 6.8311 1.7725 0.6229 4.3900 3.5244 4.1974 6.7262 11.7048 3.4239 0.9053 12.4904 32.4130 2.9788 7.6121 21.6795 6.3035 1.7667 2.0260 2.8688 3.0874 8.3831 0.8840 39.7192 52.1549 35.1976 11.0084 120.7287 5.5582 0.5280 1.8812 5.9141 8.8032 16.2235 19.5358 11.4379 1.4131 7.7178 40.4204 56.4695 17.7210 15.9826 14.6089 5.3430 36.9237 38.7641 0.4446 4.5505 2.5040 2.2947 45.8533 51.1750 0.4183 0.2965 0.3469 1.7932 20.3073 3.8328 106.3888 12.3064 3.6473 4.1502 9.6906 1.3731 8.9874 17.1502 9.5630 6.6229 19.8065 29.1533 29.8807 11.8452 104.5337 27.8037 17.6027 7.5855 19.2823 26.0153 938.7715 215.2519 45.7653 154.7053 210.0812 17.2769 15.8553 12.7365 53.1426 144.7884 47.3535 62.7701 5.6358 12.4038 23.4398 52.3824 150.1587 25.2833 58.6230 30.3020 115.5547 29.1222 220.4612 15.4654 57.6182 24.3704 4.2953 1.9951 47.3936 19.6374 12.8091 405.4585 135.3097 38.8058 1006.4473 355.9277 22.9936 24.6187 198.9135 77.1816 208.8997 162.5762 68.2232 49.8060 84.8443 38.2301 57.7198 15.1156 37.7500 48.5520 43.3629 46.8635 13.7170 6.0788 8.9644 7.1795 11.3507 10.7735 13.5057 10.7857 3.4931 7.0685 7.5677 25.8374 17.0562
temp: 298.150 k
press: 1.00000 atm
elementType: 8 8 8 8 8 8 7 7 7 7 7 7 7 6 6 6 6 6 6 6 6 6 6 6 6 6 6 6 6 6 6 6 6 1 1 1 1 1 1 1 1 1 1 1 1 1 1 1 1 1 1 1 1 1 1 1
symmnumber: 1
zpe: 1131399.3 jmol-1
zpe.correction: 0.430927 hartree
zpe.thermalcorrener: 0.461538 hartree
zpe.thermalcorrenthalpy: 0.462482 hartree
zpe.thermalcorrgfe: 0.361131 hartree
zpe.sumelectzpe: -1607.981447 hartree
zpe.sumelectthermal: -1607.950837 hartree
zpe.sumelectthermalent: -1607.949892 hartree
zpe.sumelectthermalfe: -1608.051243 hartree
dipole: 1.5049 -2.8832 2.7403
dipole: 4.2529
quadrupole: -347.9584 -179.1008 -202.7012
quadrupole: -13.8812 -0.1424 -11.8613
quadrupole: -104.7049 64.1526 40.5523 -13.8812 -0.1424 -11.8613
hfenergy: -1608.4123743 hartree
pointgroup: C01 [X(C20H23N7O6)]
dipole: -0.5546068 0.0560323 -1.5776239 debye
polarizability: 480.973658|-4.6183229|240.2105832|10.7975647|61.7874181|238.8051906 unknown
InChI: InChI=1S/C20H23N7O6/c28-19(22-15-3-1-5-17(13-15)26(30)31)21-7-8-24-9-11-25(12-10-24)20(29)23-16-4-2-6-18(14-16)27(32)33/h1-6,13-14,21-23H,7-12H2
charge 0 multiplicity 1
56 atoms
O  4.134405 2.326739 0.773789
O  -3.8666 1.270902 -0.057426
O  10.688671 -1.644705 1.384759
O  9.223164 -2.543382 -0.112264
O  -11.14594 -0.82798 1.425687
O  -10.256845 -1.872539 -0.395201
N  0.275824 0.085484 -1.337696
N  2.95301 0.92738 -0.674498
N  -3.48567 -0.120049 -1.890007
N  5.177548 0.38141 -0.040859
N  -5.584173 -0.157774 -0.842576
N  9.557866 -1.651571 0.762835
N  -10.179556 -1.051019 0.600444
C  0.501462 1.258429 -0.449952
C  1.348577 -0.913436 -1.134888
C  1.853102 1.914374 -0.772831
C  2.72815 -0.29806 -1.466386
C  -1.089355 -0.478875 -1.224459
C  -2.101668 0.350237 -2.055182
C  4.089087 1.273685 0.063597
C  6.403293 0.436973 0.667204
C  -4.283986 0.390711 -0.869096
C  7.351472 -0.58145 0.391418
C  6.722123 1.443926 1.624831
C  8.58451 -0.574154 1.070037
C  -6.619145 0.120536 0.083895
C  7.968916 1.413211 2.285092
C  8.92364 0.409227 2.023883
C  -7.847863 -0.56441 -0.093214
C  -6.479878 1.038831 1.164849
C  -8.902837 -0.321366 0.806168
C  -7.562255 1.252479 2.044558
C  -8.791638 0.580523 1.885616
H  0.482657 0.95791 0.626833
H  -0.302034 1.998755 -0.604204
H  1.174292 -1.771865 -1.809656
H  1.371824 -1.297011 -0.083018
H  2.074543 2.731085 -0.068357
H  1.822482 2.32278 -1.803265
H  2.761549 -0.058225 -2.54917
H  3.492496 -1.064756 -1.253457
H  -1.444875 -0.521749 -0.167757
H  -1.071607 -1.516912 -1.608598
H  -1.824657 0.309938 -3.123018
H  -2.074328 1.404519 -1.733424
H  -3.819303 -0.872087 -2.493872
H  5.111612 -0.374967 -0.721707
H  7.156209 -1.378083 -0.334362
H  5.991399 2.22928 1.824522
H  -5.829146 -0.824219 -1.577909
H  8.196647 2.194564 3.017468
H  9.893257 0.372715 2.525194
H  -8.00523 -1.278461 -0.908665
H  -5.532874 1.566286 1.291457
H  -7.439141 1.96082 2.870198
H  -9.638783 0.7351 2.557336
