program: Gaussian 09
title: 000244088
version: EM64L-G09RevD.01
frameworkgroup: C1[X(C16H15NO5)]
method: RPBEPBE
basis: SDD
operation: Freq
keyword: #p
keyword: freq=noraman
keyword: PBEPBE/SDD
title: #p freq=noraman PBEPBE/SDD
converged: YES YES NO NO
title: Mulliken charges:
elementType: O O O O O N C C C C C C C C C C C C C C C C H H H H H H H H H H H H H H H
charge: -0.345328 -0.287389 -0.431409 -0.210328 -0.197061 0.003693 0.226339 -0.614569 0.112415 0.040584 0.049731 -0.337037 0.253242 -0.370134 0.136516 0.354773 -0.287628 -0.286889 -0.524137 -0.345430 -0.358591 -0.530434 0.260751 0.289664 0.288916 0.259983 0.272706 0.234261 0.391572 0.234783 0.263722 0.239606 0.245490 0.241099 0.233393 0.254575 0.238549
chargesum: 0.00000
title: Mulliken charges with hydrogens summed into heavy atoms:
elementType: O O O O O N C C C C C C C C C C C C C C C C
charge: -0.345328 -0.287389 -0.039837 -0.210328 -0.197061 0.003693 0.226339 -0.064154 0.112415 0.040584 0.049731 -0.048120 0.253242 -0.110151 0.136516 0.354773 -0.014922 -0.052627 0.213974 -0.099940 -0.117492 0.196082
polarizability: 2.89579777e+02 1.65042008e+00 1.75539089e+02 2.23158140e+01 9.64515103e-01 1.40089975e+02
1716.lowfreq: -4.6130 0.0007 0.0009 0.0010 3.2456 7.1650 13.6827 22.2372 31.1639
frequency: 13.5669 22.2078 31.1548 57.2101 69.6393 84.1145 103.1197 113.5010 126.8837 136.9941 147.6042 160.2932 166.4810 191.6899 216.7704 227.9313 256.7862 278.8935 325.1749 342.6856 359.3644 366.4250 386.8518 397.9393 432.1724 453.0438 482.0130 516.6570 518.0331 583.9335 595.3517 604.7789 624.3528 642.5436 649.0623 659.5113 687.2880 729.5360 741.0613 759.7680 781.6484 820.3426 837.4415 860.1645 892.6587 908.2394 924.7092 957.6662 960.7849 971.6453 986.9876 992.9650 1009.0064 1032.6747 1050.7925 1061.5026 1087.0619 1114.4291 1118.2403 1143.4053 1154.6164 1156.8969 1165.7655 1181.5787 1216.3305 1219.6578 1245.0028 1273.4630 1281.5658 1300.6931 1308.1887 1325.5707 1394.8261 1399.6893 1402.6515 1410.3604 1432.4822 1441.0411 1455.1870 1461.2802 1463.0096 1474.1528 1482.5676 1488.1606 1547.2099 1551.5721 1579.4537 1582.4467 1605.4007 1614.0880 2982.6865 2986.8055 3009.0009 3066.5344 3080.8081 3089.5099 3132.0813 3133.3244 3134.3289 3139.8072 3156.7722 3162.0575 3171.4836 3177.7539 3397.1024
redmass: 6.6753 5.9540 3.9081 4.1530 6.2848 7.0742 3.7988 4.3012 3.3946 3.3803 1.2447 1.1319 5.6830 3.7206 4.2319 5.0756 8.1091 5.7152 5.6575 6.0204 4.4789 2.4924 5.3439 7.1305 5.8620 3.4038 5.2475 4.2263 6.4097 5.0930 4.2826 5.6160 4.9347 4.2838 1.1101 6.9545 5.6820 5.2647 3.7059 5.9024 3.0569 2.4668 1.5100 2.6669 1.2623 7.7653 2.9343 7.4307 6.7956 1.4511 1.3393 1.4387 4.7403 3.7825 3.3830 1.9113 1.6324 1.2401 1.2413 1.3544 1.3510 1.3344 1.6869 2.2926 1.3653 2.5084 2.1876 2.2672 2.7658 7.6392 2.0512 1.4737 2.8527 1.9554 2.5117 1.3209 1.3470 1.4631 1.0593 1.0594 1.9509 1.1208 2.3110 1.0523 7.9205 8.1289 5.7003 8.5563 9.3102 6.7505 1.0304 1.0303 1.0618 1.0971 1.1046 1.1046 1.1032 1.0881 1.1042 1.0900 1.0884 1.0958 1.0967 1.0966 1.0631
irintensity: 0.2000 0.3638 0.2111 1.6831 1.1686 0.5316 2.4411 7.4732 3.7831 5.5254 1.0953 0.3285 3.0931 5.9699 10.5652 9.1975 4.1779 11.0033 15.8204 0.4792 2.6382 0.3541 1.9923 1.3959 3.9356 2.9631 29.8273 4.9758 23.3457 18.6128 7.6866 14.5559 7.2552 21.2764 120.8195 1.0815 10.0965 6.1209 0.7378 1.8438 26.5042 10.3215 42.7921 13.7670 3.3991 43.9991 3.3651 114.7332 1.0294 0.0859 2.5374 0.4055 22.0555 132.8000 85.4816 7.9633 0.1399 20.9730 6.1073 1.7290 0.9100 25.5811 35.6995 34.8245 55.0092 170.1830 97.9067 270.2966 46.5190 2.6183 181.8942 13.9785 122.8123 48.1118 5.3277 109.7994 4.1195 27.5724 16.7878 2.9349 2.6792 6.3293 10.1367 23.0537 47.5130 205.5824 6.1047 85.2097 158.0011 103.3842 68.7936 51.0783 2.3211 8.2460 23.9139 19.7560 19.3861 13.4975 15.5351 18.8830 0.9806 23.2424 6.1802 5.4294 103.2208
temp: 298.150 k
press: 1.00000 atm
elementType: 8 8 8 8 8 7 6 6 6 6 6 6 6 6 6 6 6 6 6 6 6 6 1 1 1 1 1 1 1 1 1 1 1 1 1 1 1
symmnumber: 1
zpe: 730976.5 jmol-1
zpe.correction: 0.278414 hartree
zpe.thermalcorrener: 0.299418 hartree
zpe.thermalcorrenthalpy: 0.300362 hartree
zpe.thermalcorrgfe: 0.225951 hartree
zpe.sumelectzpe: -1047.931953 hartree
zpe.sumelectthermal: -1047.910948 hartree
zpe.sumelectthermalent: -1047.910004 hartree
zpe.sumelectthermalfe: -1047.984416 hartree
dipole: -8.5566 0.6968 -3.5011
dipole: 9.2714
quadrupole: -118.5303 -127.8290 -131.9938
quadrupole: -0.5829 7.4803 -3.0409
quadrupole: 7.5874 -1.7113 -5.8761 -0.5829 7.4803 -3.0409
hfenergy: -1048.2103668 hartree
pointgroup: C01 [X(C16H15N1O5)]
dipole: -3.379995 -0.9372205 -1.0013273 debye
polarizability: 289.736329|19.244353|154.9658791|10.0851633|-17.7604214|160.5066333 unknown
InChI: InChI=1S/C16H15NO5/c1-21-14-4-3-11(15(20)16(14)22-2)13(19)9-12(18)10-5-7-17-8-6-10/h3-8,20H,9H2,1-2H3
charge 0 multiplicity 1
37 atoms
O  -3.91268 -0.362099 -1.439303
O  -5.003602 -0.568245 1.318916
O  -1.342932 0.18084 -1.811383
O  1.241586 0.950192 1.547911
O  3.141052 2.253855 -1.148664
N  5.595318 -1.90588 0.474744
C  -0.894617 0.387026 0.609625
C  1.223263 0.797763 -0.880256
C  0.562273 0.7185 0.502544
C  -1.770331 0.133684 -0.482939
C  -3.143755 -0.161065 -0.257931
C  -1.455057 0.331378 1.921696
C  -3.656948 -0.266248 1.055382
C  -2.799735 0.010283 2.150846
C  2.716892 1.115623 -0.802983
C  3.679809 0.050276 -0.346773
C  5.056715 0.374114 -0.234685
C  3.283974 -1.274738 -0.03497
C  -5.002894 0.634966 -1.634694
C  5.96597 -0.621609 0.176062
C  4.267244 -2.207414 0.364624
C  -5.497209 -1.857651 0.77151
H  1.027355 -0.135407 -1.441029
H  0.729014 1.59742 -1.461052
H  -0.77527 0.537865 2.754331
H  -3.212969 -0.050292 3.161351
H  5.387346 1.390813 -0.467226
H  2.237378 -1.589398 -0.09073
H  -2.13702 -0.052279 -2.375041
H  -4.578181 1.651871 -1.718996
H  -5.711331 0.594255 -0.789819
H  -5.499304 0.345655 -2.5727
H  7.034536 -0.401692 0.275224
H  3.9926 -3.239035 0.611928
H  -4.984048 -2.695864 1.277357
H  -5.333744 -1.921238 -0.318729
H  -6.571401 -1.877227 1.006756
