program: Gaussian 09
title: 000244052
version: EM64L-G09RevD.01
frameworkgroup: C1[X(C9H10ClNO2)]
method: RPBEPBE
basis: SDD
operation: Freq
keyword: #p
keyword: freq=noraman
keyword: PBEPBE/SDD
title: #p freq=noraman PBEPBE/SDD
converged: NO YES NO NO
title: Mulliken charges:
elementType: Cl O O N C C C C C C C C C H H H H H H H H H H
charge: -0.058298 -0.320476 -0.258703 -0.600937 0.570966 0.421250 -0.573298 -0.308538 -0.362189 -0.203009 -0.794958 -0.349849 0.158244 0.253099 0.257256 0.255060 0.247823 0.247784 0.223525 0.248617 0.248570 0.337948 0.360112
chargesum: 0.00000
title: Mulliken charges with hydrogens summed into heavy atoms:
elementType: Cl O O N C C C C C C C C C
charge: -0.058298 -0.320476 -0.258703 0.097123 0.570966 0.421250 -0.320198 -0.308538 -0.104933 0.052050 -0.075825 0.147338 0.158244
polarizability: 1.82388196e+02 4.28495809e+00 1.22508942e+02 1.95830093e-02 -1.15967566e-02 5.66760815e+01
1716.lowfreq: -9.9568 -8.9562 -4.8030 -0.0011 0.0018 0.0021 33.3064 39.4741 85.9451
frequency: 33.2485 39.2631 85.9435 118.9871 121.6909 135.3415 205.5419 215.3298 235.2852 268.5096 320.5455 359.4238 442.6804 446.4974 500.5424 518.6120 529.8305 545.3609 567.3082 632.8669 642.1208 659.6881 701.6708 731.7893 800.5461 877.3009 879.0267 908.7828 928.6111 980.5705 1002.2667 1021.3864 1026.8469 1047.6986 1072.9615 1143.8337 1167.7826 1201.2982 1237.2001 1273.2368 1334.3863 1364.4950 1381.2300 1402.2636 1409.6293 1453.3077 1459.2719 1461.8185 1480.8927 1570.6083 1580.4285 1617.2497 1653.6000 2981.8131 2988.4891 3046.4306 3068.8940 3099.4034 3153.0323 3158.3983 3177.6947 3510.9329 3672.2825
redmass: 6.7913 5.5095 6.7009 6.9103 1.1024 2.3203 6.1270 3.1560 5.6854 4.7595 6.7399 5.7481 2.8950 6.2663 3.2253 1.6092 3.9920 5.3173 3.3968 1.2912 7.2762 1.3814 3.1931 6.7622 1.3812 1.4637 3.5615 4.6419 1.3449 2.4335 1.8365 2.1536 4.8559 1.5268 1.8591 1.5113 1.7574 1.0728 2.4329 1.6977 1.3756 4.2503 5.7292 1.3179 2.4150 1.1618 2.1852 1.0441 1.2951 1.4314 4.9957 6.7385 5.7351 1.0555 1.0369 1.1063 1.0973 1.0999 1.0918 1.0883 1.0969 1.0445 1.1047
irintensity: 0.2326 6.1166 3.1247 0.0455 3.1833 9.3672 6.6269 0.5303 2.8292 8.4262 3.3715 1.1252 6.1225 15.1478 5.2112 42.5657 9.3534 1.6238 2.4549 262.9872 35.5861 8.6922 2.1553 5.5083 46.8014 30.0615 1.8790 3.2939 0.0020 39.2950 0.2864 119.2650 18.6939 11.1981 12.6607 69.2025 107.3250 1.6559 75.0866 69.4364 4.0403 78.5708 17.3158 15.2166 54.8411 35.9479 32.3883 14.5937 109.0557 182.8155 3.4561 28.8955 349.2759 22.6548 17.6032 16.3346 12.7458 16.8753 6.0867 3.9973 4.5046 41.2418 73.6997
temp: 298.150 k
press: 1.00000 atm
elementType: 17 8 8 7 6 6 6 6 6 6 6 6 6 1 1 1 1 1 1 1 1 1 1
symmnumber: 1
zpe: 458492.6 jmol-1
zpe.correction: 0.174631 hartree
zpe.thermalcorrener: 0.187646 hartree
zpe.thermalcorrenthalpy: 0.188590 hartree
zpe.thermalcorrgfe: 0.133668 hartree
zpe.sumelectzpe: -1013.266971 hartree
zpe.sumelectthermal: -1013.253956 hartree
zpe.sumelectthermalent: -1013.253012 hartree
zpe.sumelectthermalfe: -1013.307934 hartree
dipole: 1.0158 2.6889 -0.0077
dipole: 2.8744
quadrupole: -106.0641 -72.2938 -85.8566
quadrupole: -10.2427 0.0607 -0.0027
quadrupole: -17.9926 15.7777 2.2149 -10.2427 0.0607 -0.0027
hfenergy: -1013.4416019 hartree
pointgroup: C01 [X(C9H10Cl1N1O2)]
dipole: 0.3001957 -1.0512104 0.2893212 debye
dipolederiv: -0.8372091 -0.0555644 -0.0148714 -0.0846312 -0.1323557 0.0133658 -0.0072528 0.0145254 -0.072609 -2.0767196 0.2055942 -0.1226472 0.1279273 -0.3535565 0.022812 -0.1020604 0.0260289 -0.2960722 -1.0155884 0.348881 -0.1175896 0.1677614 -0.7981494 0.1193627 -0.0686472 0.1250986 -0.4088283 -0.4639374 -0.164528 0.0515485 -0.0410973 -1.0789651 0.1055311 0.0185309 0.1010094 -0.6978321 0.0233412 -0.1583699 0.0407184 -0.1597663 0.2533714 -0.0636726 0.0407556 -0.0632242 0.0494256 1.6825783 -0.0723192 0.0785386 0.2215545 0.0915822 0.0170395 0.0012758 0.0056074 0.1215559 -0.3992817 0.0960024 -0.0326444 0.1936468 -0.0616917 -0.0286714 -0.058183 -0.0324618 -0.1942395 1.0695645 0.1515076 0.0063201 0.1874781 -0.118766 0.0034751 -0.0029949 0.0019956 -0.1334742 -0.3450611 0.0607093 -0.0205001 -0.2279106 -0.0737958 -0.0469632 0.0551198 -0.0359818 -0.2078976 -0.09175 -0.0876883 0.0221759 -0.0066868 0.0600265 -0.0354733 0.0011564 -0.0385632 -0.0653118 -0.0727801 0.1639828 -0.047325 0.1179783 -0.0132304 0.0203355 -0.034927 0.0214301 0.0412759 0.4660899 -0.230585 0.0639127 -0.7367236 0.3412933 -0.0201274 0.195723 -0.0009199 0.3805173 1.2899851 -0.1601167 0.0856549 -0.0649643 1.4416119 -0.3348002 0.0606672 -0.3376257 0.2777648 0.0517451 -0.0634204 0.0121887 -0.0726207 -0.0178879 0.0449887 0.0146129 0.0453156 0.1542986 0.0267799 0.0832681 -0.027477 0.0958113 0.012887 0.0462308 -0.0307402 0.0458539 0.1626875 0.0545204 -0.0570464 0.010808 -0.0547679 -0.0030612 0.0403824 0.0102103 0.040333 0.1497895 0.0225042 0.0685533 0.0865484 0.0486561 0.0476512 0.0086228 0.0968883 -0.0442008 -0.0127986 0.036534 0.0162451 -0.1049598 -0.0027877 0.0488361 -0.0453918 -0.10498 0.0090991 -0.027342 0.0083807 -0.1587478 0.0380933 -0.0547606 -0.056386 0.0417642 0.0106675 0.0379882 0.1003948 0.0180787 -0.0235498 -0.0350922 0.1079048 -0.0444616 -0.0597846 -0.0510125 -0.0791163 0.0028243 0.0134196 -0.0084399 0.0475133 0.1149998 0.028567 0.0558662 -0.0036142 0.0653051 -0.0652076 0.1616303 0.0193701 -0.0139498 0.0057269 0.2133852 0.0468947 -0.0100988 0.0475497 0.3762583 0.3771755 0.0262618 -0.0069643 0.1172719 0.2130956 0.048213 -0.0310968 0.0449538 0.3648206 unknown
polarizability: 180.9241996|-8.2195916|119.3426142|6.8993228|-16.6998546|61.3064059 unknown
InChI: InChI=1S/C9H10ClNO2/c1-6-4-7(2-3-8(6)10)13-5-9(11)12/h2-4H,5,11H2,1H3
charge 0 multiplicity 1
23 atoms
Cl 4.514019 0.60714 -0.043278
O  -1.483684 0.006573 -0.115001
O  -4.745511 1.524386 -0.64181
N  -4.027069 -0.622945 -0.046998
C  2.111369 -0.824763 0.238283
C  -0.09203 0.226195 -0.119168
C  0.700478 -0.900324 0.204576
C  2.692717 0.433778 -0.067461
C  0.513208 1.468573 -0.420386
C  1.923087 1.562745 -0.391039
C  2.950062 -2.037047 0.585423
C  -2.35914 1.137886 -0.446763
C  -3.826303 0.691777 -0.387713
H  0.200417 -1.847282 0.432038
H  -0.075738 2.353757 -0.674373
H  2.413311 2.513245 -0.620106
H  3.639118 -2.293121 -0.239946
H  3.579138 -1.843647 1.473308
H  2.313229 -2.912671 0.79273
H  -2.221171 1.968746 0.272356
H  -2.151727 1.511445 -1.468433
H  -4.978452 -0.982232 0.011755
H  -3.221828 -1.220511 0.143007
