program: Gaussian 09
title: 000244050
version: EM64L-G09RevD.01
frameworkgroup: C1[X(C11H14ClNO2)]
method: RPBEPBE
basis: SDD
operation: Freq
keyword: #p
keyword: freq=noraman
keyword: PBEPBE/SDD
title: #p freq=noraman PBEPBE/SDD
converged: YES YES NO NO
title: Mulliken charges:
elementType: Cl O O N C C C C C C C C C C C H H H H H H H H H H H H H H
charge: -0.066369 -0.295852 -0.268094 -0.349217 0.219570 0.337157 -0.438515 -0.334481 -0.311916 -0.365377 0.191426 -0.781090 -0.243135 -0.109311 -0.649811 0.247335 0.262480 0.255782 0.220326 0.264196 0.262079 0.334286 0.245629 0.232910 0.220674 0.257584 0.206361 0.234390 0.220981
chargesum: 0.00000
title: Mulliken charges with hydrogens summed into heavy atoms:
elementType: Cl O O N C C C C C C C C C C C
charge: -0.066369 -0.295852 -0.268094 -0.014931 0.219570 0.337157 0.071300 0.141627 -0.047720 -0.103298 0.191426 -0.081878 0.014450 -0.109311 0.011921
polarizability: 1.77838139e+02 -1.14113679e+01 1.34687938e+02 1.64539868e+01 1.06001469e+01 1.10919884e+02
1716.lowfreq: -12.5178 -2.6080 -0.0020 -0.0020 0.0008 5.7063 23.0032 30.9365 38.1926
frequency: 22.8992 30.7027 38.1458 53.6860 98.9317 106.8451 111.2005 177.6870 191.2762 195.4452 220.9429 234.1501 280.6804 311.0247 342.5474 379.0876 412.2932 432.4331 443.4371 498.4386 548.0549 552.8102 574.2687 618.1155 644.7213 662.0956 711.1414 729.7212 772.3689 807.0470 853.2855 870.7531 876.0193 927.6288 931.5394 983.9993 993.0496 1002.7523 1044.7782 1075.6236 1089.6552 1112.9066 1124.6762 1146.3741 1174.8661 1218.5567 1236.5361 1241.6173 1270.3101 1285.8308 1324.6252 1356.7546 1376.4855 1388.0883 1392.8109 1402.5371 1452.5671 1458.0399 1467.2139 1469.0633 1471.6407 1478.1449 1481.7232 1507.6895 1588.5671 1601.3296 1625.6091 2983.8421 2985.6857 2996.6711 3022.2996 3063.8187 3066.8818 3085.6250 3092.0619 3097.2516 3098.4496 3157.1096 3158.7710 3178.2293 3519.6819
redmass: 3.2614 3.8050 4.2821 5.8083 5.4437 3.0146 1.1374 2.1623 3.7599 3.3592 2.9291 2.1172 3.0375 3.9371 7.3022 5.2765 2.7538 3.7252 3.0228 5.1871 3.5221 4.0456 4.5029 6.7168 3.5391 1.1834 3.7310 4.9603 1.3354 1.3930 5.2033 2.2339 1.3443 2.6986 1.3425 6.6725 1.5681 2.0278 1.5196 2.8469 1.9152 2.4529 2.3728 1.7824 1.8304 1.4996 2.1009 1.8907 1.2915 1.1702 1.2739 1.3063 7.1191 1.2190 3.0637 1.2688 1.0815 1.0461 1.4673 1.2206 1.0571 1.4392 1.0737 1.9726 6.7016 7.3224 8.1235 1.0358 1.0371 1.0652 1.0583 1.0963 1.0984 1.0981 1.1058 1.1003 1.1018 1.0887 1.0922 1.0969 1.0769
irintensity: 0.1055 0.3438 2.8911 6.7216 0.7711 0.4842 0.2909 2.4470 2.5162 2.4304 3.7752 11.4823 5.3805 13.3529 8.6918 0.7229 3.2955 0.6295 4.7925 7.5188 3.9874 7.4082 1.6815 30.1856 42.2332 106.9906 0.9422 3.0680 11.8726 48.4351 35.6118 2.0733 16.8197 5.5127 0.1322 54.9642 7.2065 2.9428 6.6153 2.2383 2.2789 12.1636 150.5235 18.8997 90.9297 2.5286 80.4142 38.3555 4.5812 38.6192 5.4987 1.6388 4.9269 19.3117 15.3822 16.8793 33.5318 14.4546 61.4832 18.0268 8.0421 148.1798 16.7441 132.1901 2.6232 7.8420 226.6989 26.6819 25.8559 33.6011 22.0231 17.5416 6.9378 37.0138 7.5403 18.1744 32.5948 6.0531 1.8483 1.6790 30.3941
temp: 298.150 k
press: 1.00000 atm
elementType: 17 8 8 7 6 6 6 6 6 6 6 6 6 6 6 1 1 1 1 1 1 1 1 1 1 1 1 1 1
symmnumber: 1
zpe: 604187.3 jmol-1
zpe.correction: 0.230123 hartree
zpe.thermalcorrener: 0.246061 hartree
zpe.thermalcorrenthalpy: 0.247005 hartree
zpe.thermalcorrgfe: 0.184220 hartree
zpe.sumelectzpe: -1091.708304 hartree
zpe.sumelectthermal: -1091.692366 hartree
zpe.sumelectthermalent: -1091.691422 hartree
zpe.sumelectthermalfe: -1091.754207 hartree
dipole: -1.1055 2.3067 2.2696
dipole: 3.4197
quadrupole: -108.0011 -93.3494 -95.8434
quadrupole: -0.5989 -10.1389 -1.8618
quadrupole: -8.9365 5.7152 3.2212 -0.5989 -10.1389 -1.8618
hfenergy: -1091.938427 hartree
pointgroup: C01 [X(C11H14Cl1N1O2)]
dipole: 0.4598043 1.2642429 -0.019515 debye
polarizability: 166.7587193|-3.8896813|135.5487742|32.0577407|8.8026008|121.1384678 unknown
InChI: InChI=1S/C11H14ClNO2/c1-3-13-11(14)7-15-10-5-4-9(12)6-8(10)2/h4-6,13H,3,7H2,1-2H3
charge 0 multiplicity 1
29 atoms
Cl -4.19111 -0.903229 -2.375478
O  0.440703 0.397589 1.263289
O  3.083935 -2.153156 0.965232
N  2.713179 -0.152096 -0.200679
C  -0.619636 0.016456 0.403111
C  -1.576843 1.041296 0.148015
C  1.329513 -0.659603 1.769783
C  3.774225 -0.339759 -1.20543
C  -0.739664 -1.268072 -0.174941
C  -2.659987 0.736256 -0.707401
C  2.45216 -1.065865 0.792635
C  -1.429841 2.407676 0.784333
C  -1.831963 -1.556475 -1.025576
C  -2.774936 -0.547382 -1.278227
C  4.919784 0.682547 -1.05381
H  0.765379 -1.564816 2.057248
H  1.789794 -0.229123 2.675456
H  4.153547 -1.36686 -1.068813
H  3.330335 -0.271488 -2.217308
H  0.00415 -2.048636 0.008784
H  -3.41343 1.500909 -0.919888
H  2.131479 0.690282 -0.228122
H  -1.34476 2.324539 1.882693
H  -0.509887 2.9155 0.439531
H  -2.292114 3.051503 0.543372
H  -1.934058 -2.545942 -1.479285
H  4.555713 1.720684 -1.167056
H  5.397262 0.588297 -0.063236
H  5.689171 0.507868 -1.82783
