program: Gaussian 09
title: 000244045
version: EM64L-G09RevD.01
frameworkgroup: C1[X(C13H16N2)]
method: RPBEPBE
basis: SDD
operation: Freq
keyword: #pfreq=noraman
keyword: PBEPBE/SDD
title: #p freq=noraman PBEPBE/SDD
converged: YES YES NO NO
title: Mulliken charges:
elementType: N N C C C C C C C C C C C C C H H H H H H H H H H H H H H H H
charge: -0.288073 -0.183445 0.384821 0.385351 -0.418864 -0.418854 0.450417 -0.665111 -0.796397 -0.795874 -0.389984 -0.366303 -0.216595 -0.219294 -0.269138 0.246073 0.246050 0.232152 0.250411 0.231957 0.238179 0.249377 0.225311 0.225270 0.248977 0.238105 0.237254 0.270220 0.219394 0.222383 0.226230
chargesum: 0.00000
title: Mulliken charges with hydrogens summed into heavy atoms:
elementType: N N C C C C C C C C C C C C C
charge: -0.288073 -0.183445 0.384821 0.385351 -0.172791 -0.172804 0.450417 0.049409 -0.083529 -0.083521 -0.152731 -0.096083 0.002800 0.003089 -0.042908
polarizability: 1.89963993e+02 4.82632578e-01 1.21688611e+02 7.26844017e+00 1.45488774e+00 1.37964347e+02
1716.lowfreq: -7.5569 -0.0003 -0.0002 0.0006 6.3718 8.7058 23.6953 48.3017 59.2621
frequency: 23.4279 48.2630 59.1910 87.6895 110.8520 119.3051 146.3229 165.5375 196.1899 225.3301 249.4689 283.4325 296.5774 360.0391 372.9310 413.5486 483.5357 511.6181 518.2663 583.5526 612.5253 622.3067 640.1482 665.2677 694.6482 715.9862 753.2800 769.5495 824.6935 835.6412 836.8716 882.1180 957.5645 961.8687 967.1429 976.9920 981.1527 1023.0828 1028.9187 1031.6872 1042.7807 1048.9326 1071.0794 1099.7092 1109.1713 1132.0583 1171.5085 1193.9408 1218.0983 1243.1864 1299.0702 1331.3602 1337.6792 1349.7766 1384.9137 1399.8999 1402.4457 1407.1845 1439.5537 1448.7887 1460.8959 1464.1653 1469.2495 1474.0126 1477.3193 1492.7644 1497.3885 1547.4026 1583.1253 1587.9351 1618.5691 2948.2469 2966.9224 2968.5029 3014.7752 3036.9707 3037.8523 3093.6989 3094.0250 3116.4282 3124.5288 3132.1478 3153.7002 3160.5472 3170.3813 3200.0791 3220.0342
redmass: 3.5982 3.3249 3.4822 2.3830 1.1330 1.2560 2.1303 1.5530 1.9974 2.7785 3.3789 3.2643 3.4772 4.9567 3.4653 2.9624 3.0132 3.0433 4.6228 4.3686 6.3250 3.1899 5.4281 4.8817 2.0055 4.7331 1.7036 1.2209 1.2520 3.5226 1.3279 1.4430 2.1435 1.3958 1.6528 5.8182 1.2929 2.1455 1.3752 2.0830 1.4241 1.4563 2.5453 1.9629 1.2680 1.6925 1.0503 1.1139 1.4013 4.2116 3.1412 1.5139 3.2395 7.3646 7.0024 3.9655 1.2456 1.2478 1.2307 2.2741 1.0458 1.0543 1.0467 1.0939 1.2154 2.0444 1.2040 5.5747 6.3264 5.7262 6.0597 1.0376 1.0391 1.0389 1.1015 1.0974 1.0974 1.0965 1.0963 1.0958 1.0846 1.0889 1.0921 1.0945 1.1003 1.0928 1.1035
irintensity: 0.2774 0.3261 0.0955 1.9486 0.4366 0.2959 2.2315 0.3681 0.8509 1.5536 4.2122 0.1313 3.3206 7.6183 0.0749 0.0078 5.1647 5.4340 12.6995 4.0457 0.3306 0.0049 0.3733 2.1651 30.3251 0.0009 85.7331 75.2354 0.0508 3.1837 0.0204 5.6709 3.8365 0.1879 0.1260 2.3405 0.5422 2.3048 31.0447 0.7493 0.3354 9.9188 1.1651 18.2802 0.0353 13.9015 0.3517 5.7602 5.4950 13.3829 24.4878 2.5852 66.1585 1.2156 10.6790 25.7387 13.7945 3.4664 0.0850 3.9215 1.5807 27.3427 3.5977 11.6756 6.7596 81.0344 80.9171 4.7693 5.2882 4.8371 148.4820 66.5502 64.3302 21.8487 37.1270 2.2689 38.8532 9.8092 30.4569 12.1722 3.9708 12.3112 30.0921 24.4187 8.3008 9.1405 5.6857
temp: 298.150 k
press: 1.00000 atm
elementType: 7 7 6 6 6 6 6 6 6 6 6 6 6 6 6 1 1 1 1 1 1 1 1 1 1 1 1 1 1 1 1
symmnumber: 1
zpe: 677560.9 jmol-1
zpe.correction: 0.258069 hartree
zpe.thermalcorrener: 0.273046 hartree
zpe.thermalcorrenthalpy: 0.273990 hartree
zpe.thermalcorrgfe: 0.215085 hartree
zpe.sumelectzpe: -613.353456 hartree
zpe.sumelectthermal: -613.338479 hartree
zpe.sumelectthermalent: -613.337535 hartree
zpe.sumelectthermalfe: -613.396440 hartree
dipole: 0.2342 0.1090 1.8464
dipole: 1.8644
quadrupole: -90.6455 -88.1477 -82.6261
quadrupole: 0.0700 1.0603 0.4232
quadrupole: -3.5057 -1.0080 4.5137 0.0700 1.0603 0.4232
hfenergy: -613.6115251 hartree
pointgroup: C01 [X(C13H16N2)]
dipole: -0.0833306 0.3499189 0.6392689 debye
polarizability: 189.7765462|-4.2398342|125.055233|-6.7006415|6.7903058|134.7851719 unknown
InChI: InChI=1S/C13H16N2/c1-11-9-10-12(2)15(11)14(3)13-7-5-4-6-8-13/h4-10H,1-3H3
charge 0 multiplicity 1
31 atoms
N  1.286404 0.109623 0.248074
N  0.108149 0.472955 0.90842
C  1.951794 0.911597 -0.7086
C  1.940245 -1.135732 0.399899
C  3.045448 0.163104 -1.152794
C  3.038183 -1.108397 -0.464366
C  -1.137084 0.165466 0.315649
C  0.226354 1.174516 2.19388
C  1.458787 2.280277 -1.078019
C  1.433849 -2.186707 1.344444
C  -2.351879 0.52088 0.971668
C  -1.20217 -0.501506 -0.943627
C  -3.594068 0.21313 0.376205
C  -2.452205 -0.799428 -1.520656
C  -3.659818 -0.44762 -0.871158
H  3.772087 0.495779 -1.893152
H  3.757962 -1.916916 -0.586706
H  -0.248081 2.17574 2.15726
H  1.295873 1.302551 2.418225
H  -0.239517 0.599495 3.019317
H  2.100946 2.70093 -1.869389
H  0.419456 2.257591 -1.457532
H  1.479364 2.981635 -0.220973
H  1.465023 -1.854648 2.400753
H  0.388479 -2.473897 1.122432
H  2.060255 -3.090057 1.259712
H  -2.332593 1.032469 1.938611
H  -0.277198 -0.779536 -1.458164
H  -4.517228 0.494656 0.896262
H  -2.481146 -1.312292 -2.489034
H  -4.627073 -0.683056 -1.32684
