program: Gaussian 09
title: 000244037
version: EM64L-G09RevD.01
frameworkgroup: C1[X(C10H10N2O3)]
method: RPBEPBE
basis: SDD
operation: Freq
keyword: #p
keyword: freq=noraman
keyword: PBEPBE/SDD
title: #p freq=noraman PBEPBE/SDD
converged: YES YES NO NO
title: Mulliken charges:
elementType: O O O N N C C C C C C C C C C H H H H H H H H H H
charge: -0.233056 -0.492498 -0.236672 -0.413071 -0.401245 0.072912 0.333860 0.154549 -0.695647 0.162210 0.173737 -0.360444 -0.395034 -0.254110 -0.208936 0.375583 0.248175 0.232547 0.245807 0.349152 0.284735 0.220249 0.234198 0.233173 0.369825
chargesum: 0.00000
title: Mulliken charges with hydrogens summed into heavy atoms:
elementType: O O O N N C C C C C C C C C C
charge: -0.233056 -0.122673 -0.236672 -0.037488 -0.052092 0.072912 0.333860 0.154549 0.030882 0.162210 0.173737 -0.075709 -0.174785 -0.019912 0.024237
polarizability: 1.54393494e+02 5.45882321e+00 1.33918502e+02 -3.47059165e-01 -2.34308587e+00 8.58691128e+01
1716.lowfreq: -8.8725 -8.2908 -0.0006 -0.0003 0.0005 8.2344 45.9202 63.1913 127.9304
frequency: 45.8867 63.1823 127.9274 152.7246 170.5037 206.2145 221.3897 230.7158 270.5972 306.8084 317.4161 365.3700 383.6131 427.6117 460.3097 489.6616 537.1078 563.2388 596.1215 607.4829 611.4522 641.5218 658.7189 688.2764 718.6913 737.4740 745.3929 758.9118 794.1435 851.1263 870.2296 947.7545 951.1057 970.0509 986.6876 1038.5196 1052.3383 1081.1057 1107.4353 1139.4615 1159.5324 1177.6197 1216.7564 1227.4436 1233.6080 1306.0844 1309.9174 1320.7598 1347.7495 1380.2014 1390.0837 1435.9415 1462.5807 1472.2547 1493.3431 1597.4355 1616.0877 1672.2859 1720.8628 2996.7423 3101.2285 3112.9955 3114.7597 3142.9310 3156.8509 3172.3908 3571.1201 3590.8465 3595.3766
redmass: 7.1429 5.1817 4.3286 5.7592 10.0542 3.8499 4.3490 1.0882 4.2729 3.6827 6.1170 1.3444 3.7595 4.0779 4.0447 4.0691 6.2421 3.9174 3.8532 1.6249 3.3172 4.7317 1.2955 5.3634 5.1142 3.5842 5.8824 1.3443 5.7937 1.3977 2.8475 1.4398 2.1769 2.5030 1.3283 2.6443 2.3392 3.3134 1.9096 3.3446 1.2820 1.0872 3.0712 2.7588 2.8835 1.7347 1.6245 5.1184 1.7739 1.3389 4.2924 2.3186 1.0853 1.0567 2.4056 6.3946 6.5945 8.5390 9.6530 1.0340 1.1010 1.1015 1.0892 1.0881 1.0934 1.1002 1.0802 1.0805 1.0661
irintensity: 0.2815 0.3770 1.6541 0.8130 4.9764 1.4009 1.2740 0.5300 1.4121 2.0070 2.0507 113.7757 21.8527 7.8426 6.4833 15.3928 3.5440 1.7488 17.2402 23.5762 9.2343 15.4002 216.0700 6.7615 64.4319 2.5197 15.8111 105.2470 17.7763 0.3052 18.3844 3.2770 10.4901 9.9719 0.7582 27.8628 31.8728 24.4893 108.3518 10.1338 30.4122 5.1678 14.2616 7.2564 107.3963 73.7078 38.6646 173.5831 27.8089 13.7840 9.7134 54.4631 3.3232 5.2343 35.4063 16.4429 7.1710 428.7830 519.2952 14.2711 23.2365 5.7105 12.0936 9.0088 2.7531 22.1788 111.7578 63.8564 34.8679
temp: 298.150 k
press: 1.00000 atm
elementType: 8 8 8 7 7 6 6 6 6 6 6 6 6 6 6 1 1 1 1 1 1 1 1 1 1
symmnumber: 1
zpe: 496390.9 jmol-1
zpe.correction: 0.189065 hartree
zpe.thermalcorrener: 0.202092 hartree
zpe.thermalcorrenthalpy: 0.203036 hartree
zpe.thermalcorrgfe: 0.149827 hartree
zpe.sumelectzpe: -721.197342 hartree
zpe.sumelectthermal: -721.184315 hartree
zpe.sumelectthermalent: -721.183371 hartree
zpe.sumelectthermalfe: -721.236580 hartree
dipole: 4.6419 -1.7653 1.1781
dipole: 5.1040
quadrupole: -83.7309 -86.2864 -89.5370
quadrupole: -12.1508 -5.5978 -8.4853
quadrupole: 2.7872 0.2317 -3.0189 -12.1508 -5.5978 -8.4853
hfenergy: -721.3864074 hartree
pointgroup: C01 [X(C10H10N2O3)]
dipole: -1.5758776 -0.0110554 1.2445213 debye
dipolederiv: -0.5800481 -0.1501363 -0.0206359 -0.2018847 -0.6974472 -0.2983616 -0.1039153 -0.3549834 -0.7627807 -0.5601306 -0.1348683 -0.4862937 -0.1386411 -0.375425 -0.0439157 -0.4680834 -0.0482252 -0.9328892 -1.0171425 -0.4811195 0.0452186 -0.638173 -0.8526079 -0.0153466 -0.0328819 -0.1070226 -0.4948174 -1.032844 -0.1546773 0.2464994 -0.1896039 -0.6205858 0.1965047 0.3760248 0.1917015 -0.6505762 -0.7854126 -0.4756111 -0.2373654 -0.4315874 -0.865135 -0.3669234 -0.0348319 -0.2362981 -0.648947 0.4775036 0.0259182 0.0621247 0.1803789 0.4303325 -0.0925465 0.2598047 0.0300983 -0.1297146 0.1598402 -0.0954048 -0.0384012 -0.1817853 -0.1182634 0.001924 -0.1291946 -0.0062664 -0.2058033 0.9509039 0.6406927 0.0206573 0.6067397 0.8895815 0.4011004 -0.2213915 0.2684384 0.8490442 -0.1093794 0.0278474 0.02698 -0.0322773 -0.0444414 -0.0168235 -0.0270423 0.0363014 0.0202566 1.4334494 0.8004929 -0.2249709 1.0038469 1.1679892 0.2279162 -0.2406428 0.3156461 1.2564904 0.3594312 0.0786755 0.4827558 0.0756274 0.0838786 0.1364449 0.4546454 0.1227308 0.7897957 -0.0091468 -0.043296 0.0085169 -0.0097981 -0.0702718 0.0556357 0.0820772 0.0178974 0.0040599 -0.2023661 -0.0774825 -0.2311116 0.0149313 -0.1471403 0.0970361 -0.00083 0.047727 -0.0876057 -0.1118015 0.0234247 0.112332 0.0569294 -0.1681614 0.0251499 0.1350133 0.0269071 -0.0134745 0.0739162 -0.0445519 0.0498843 -0.0830786 -0.0877957 0.0649243 -0.0512246 0.0875601 0.0752851 0.3915579 -0.0911144 0.0274541 -0.0893979 0.2440155 -0.0337756 -0.0558403 -0.0427857 0.2756754 0.0454363 -0.0787082 -0.0460515 -0.0992217 0.0007429 -0.003114 -0.041009 -0.0682029 0.0465308 -0.1354861 0.0879318 -0.0112679 0.0892536 0.0452935 0.0086669 -0.0138715 0.0216822 0.0985756 0.0865177 -0.0026544 0.0724452 -0.0204192 0.0826915 -0.0189923 0.068874 0.0178942 -0.0711619 0.2682343 -0.0822561 0.018784 -0.0949424 0.2564594 -0.0481461 -0.0155817 -0.069581 0.2241302 0.1694331 0.0238086 0.030007 -0.012074 0.120568 -0.0447013 0.0214172 -0.0368441 0.0441289 0.0670977 0.0309662 0.012317 0.0445836 0.1228537 -0.0986751 0.0452612 -0.1023085 -0.0821622 -0.0009129 0.0080991 -0.0873704 0.0029805 0.1470662 -0.0477389 -0.1083642 -0.0429378 -0.0194773 -0.1001987 0.0692011 0.0066047 0.0724175 0.1306785 -0.0231286 0.0137643 -0.0245956 0.0990791 0.1615479 0.0948227 0.1608874 0.0751959 0.3251239 -0.063114 0.087823 -0.0445334 0.3163581 unknown
polarizability: 155.3774652|4.8248243|94.9279675|-1.9479871|18.207597|123.8756754 unknown
InChI: InChI=1S/C10H10N2O3/c1-10(8(14)11-9(15)12-10)6-4-2-3-5-7(6)13/h2-5,11-13H,1H3
charge 0 multiplicity 1
25 atoms
O  0.835333 -1.693325 -2.414157
O  -0.448016 0.46234 2.239441
O  3.396502 1.668733 -0.323215
N  1.588459 0.318555 0.447015
N  2.285388 0.018364 -1.657113
C  0.677303 -0.719971 -0.088217
C  -0.796452 -0.261595 -0.051912
C  1.231898 -0.882778 -1.540382
C  0.832546 -2.075172 0.659186
C  2.517983 0.784748 -0.460764
C  -1.327701 0.310679 1.136875
C  -1.677907 -0.438258 -1.144638
C  -2.677442 0.713769 1.225015
C  -3.033056 -0.043471 -1.068514
C  -3.533861 0.536358 0.116901
H  1.430332 0.732757 1.366111
H  0.249128 -2.851699 0.136586
H  1.892954 -2.380961 0.685929
H  0.463719 -1.975793 1.693328
H  2.860519 0.131278 -2.492021
H  -1.297857 -0.902814 -2.059581
H  -3.058689 1.162267 2.151929
H  -3.690524 -0.190522 -1.931109
H  -4.581206 0.848625 0.185191
H  -0.919053 0.855584 3.014119
