program: Gaussian 09
title: 000244047
version: EM64L-G09RevD.01
frameworkgroup: C1[X(C14H23N3)]
method: RPBEPBE
basis: SDD
operation: Freq
keyword: #pfreq=noraman
keyword: PBEPBE/SDD
title: #p freq=noraman PBEPBE/SDD
converged: YES YES NO NO
title: Mulliken charges:
elementType: N N N C C C C C C C C C C C C C C H H H H H H H H H H H H H H H H H H H H H H H
charge: -0.107463 -0.073535 -0.682803 -0.388916 -0.322535 -0.326970 -0.471366 -0.672859 -0.673938 0.187858 0.118413 0.319416 -0.399182 -0.410900 -0.800142 -0.248455 -0.228527 0.203934 0.218070 0.199993 0.187880 0.205010 0.188010 0.197605 0.216598 0.213983 0.223583 0.203556 0.208505 0.223016 0.204345 0.248959 0.229908 0.267114 0.224475 0.205791 0.227671 0.226751 0.336393 0.320753
chargesum: 0.00000
title: Mulliken charges with hydrogens summed into heavy atoms:
elementType: N N N C C C C C C C C C C C C C C
charge: -0.107463 -0.073535 -0.025658 0.033087 0.065338 0.066051 -0.057163 -0.031737 -0.038072 0.187858 0.118413 0.319416 -0.150223 -0.180993 -0.102762 -0.020784 -0.001775
polarizability: 2.42073516e+02 5.17151893e+00 1.64269787e+02 -1.06790802e+01 3.81619304e+00 1.28758149e+02
1716.lowfreq: -11.8632 -8.0816 -5.6859 -0.0007 0.0002 0.0004 16.9290 25.0023 43.3225
frequency: 15.5489 24.1897 43.2660 46.8327 74.5533 82.5245 88.5219 115.7684 127.1960 156.7568 171.2215 190.0700 211.4919 230.1323 265.5287 278.4769 305.9414 309.9911 331.4961 373.7240 408.1895 423.0559 445.1556 457.3990 461.7362 479.2434 500.5767 536.8206 563.3105 632.9652 679.7310 725.5296 741.0121 753.0794 774.9849 781.9803 794.0338 797.7460 818.9833 877.8331 912.2541 946.8997 954.9629 987.6419 989.3447 991.1937 1045.1295 1046.7459 1048.3809 1052.3201 1074.9075 1081.2183 1084.8804 1087.0814 1106.8771 1111.7989 1145.5645 1156.2258 1175.1347 1207.5120 1212.7931 1236.2948 1277.7845 1281.5785 1287.1865 1291.6291 1316.4636 1333.4156 1359.9889 1363.6349 1372.5100 1377.0144 1385.5421 1386.8931 1399.8235 1424.5202 1445.6393 1449.9641 1458.3904 1461.4017 1469.5098 1470.2227 1475.8716 1478.4099 1486.1356 1486.4870 1490.7950 1580.6034 1597.6160 1610.4501 1631.8079 2847.9240 2858.5486 2881.3485 2897.1635 2940.2991 2981.0618 2981.5307 2987.3760 3022.6697 3029.5464 3055.4396 3073.3222 3074.9705 3075.1314 3088.5534 3088.9667 3089.8252 3118.4243 3124.8824 3140.0159 3160.5436 3544.3486 3687.9454
redmass: 3.5092 3.7099 3.5472 3.4562 2.6551 2.2353 2.9408 2.5952 1.0889 1.8039 2.7802 1.6090 1.6537 2.2924 2.8225 1.8999 3.1627 2.4503 3.1827 3.1828 2.1326 2.8983 1.3783 2.6389 2.2331 1.6536 2.3697 3.7866 4.1143 4.7252 5.0399 3.5187 1.9269 2.4684 1.8056 1.2507 1.1388 1.2761 3.9983 1.3078 1.9575 3.5609 1.4861 2.3122 1.3357 1.5913 1.6566 1.9877 1.8722 2.4509 2.0085 2.8297 2.1104 2.4907 2.1217 1.8128 1.7711 1.5070 1.0641 2.2597 2.5062 1.6432 1.1544 1.4420 1.1806 1.2064 1.3982 3.9052 1.3460 1.3544 7.2737 1.4305 1.2377 1.2335 1.2329 1.9339 1.0778 1.0747 1.0624 1.0538 1.0590 1.1718 1.0665 1.0542 2.5606 1.0807 1.0754 6.8928 2.5001 3.7222 2.0456 1.0720 1.0716 1.0581 1.0715 1.0972 1.0356 1.0356 1.0364 1.0868 1.0873 1.0911 1.0985 1.0973 1.0979 1.1002 1.0997 1.1003 1.0851 1.0888 1.0938 1.1009 1.0444 1.1038
irintensity: 0.4959 0.0834 0.5077 0.9501 0.5604 0.5024 2.3646 3.4689 0.6183 1.9593 1.7874 1.1249 3.2273 5.1556 1.2400 0.6255 4.2372 0.5910 0.0033 4.0833 31.3694 4.8268 205.3405 11.1608 10.4504 0.6612 0.9226 1.6539 2.1309 6.0769 11.9817 3.4351 36.1507 5.3338 40.4888 2.7684 4.2848 15.5318 0.5046 0.5451 0.8791 11.2687 2.3362 5.6716 0.0755 1.2124 25.0671 16.5076 14.5597 5.1323 17.3813 41.0628 2.0229 12.6159 6.8367 9.0445 4.3668 9.7508 0.7767 40.5634 0.6041 18.2001 13.0798 0.4883 23.8156 17.4564 13.3724 68.3660 1.7939 1.0925 7.7344 11.9889 25.8285 20.7404 16.1676 3.5131 10.0512 17.9246 4.5056 4.0210 4.3330 26.3911 11.2991 6.4847 22.2370 10.7674 10.6074 17.1029 103.3440 22.3702 274.4196 42.7020 157.0034 58.0458 83.6741 52.5363 43.9231 26.0639 28.1616 17.2410 27.2451 28.8112 43.3090 30.6729 70.6878 47.9614 18.2332 43.3021 7.1990 3.6847 34.5231 34.5393 21.5799 17.1909
temp: 298.150 k
press: 1.00000 atm
elementType: 7 7 7 6 6 6 6 6 6 6 6 6 6 6 6 6 6 1 1 1 1 1 1 1 1 1 1 1 1 1 1 1 1 1 1 1 1 1 1 1
symmnumber: 1
zpe: 908880.1 jmol-1
zpe.correction: 0.346174 hartree
zpe.thermalcorrener: 0.365594 hartree
zpe.thermalcorrenthalpy: 0.366538 hartree
zpe.thermalcorrgfe: 0.296212 hartree
zpe.sumelectzpe: -710.202068 hartree
zpe.sumelectthermal: -710.182648 hartree
zpe.sumelectthermalent: -710.181704 hartree
zpe.sumelectthermalfe: -710.252030 hartree
dipole: -0.0768 -1.1090 -1.8771
dipole: 2.1816
quadrupole: -96.0266 -97.0586 -104.2516
quadrupole: 4.1499 0.7783 3.7107
quadrupole: 3.0857 2.0536 -5.1393 4.1499 0.7783 3.7107
hfenergy: -710.548242 hartree
pointgroup: C01 [X(C14H23N3)]
dipole: -0.0264032 -0.4999623 0.6971566 debye
polarizability: 241.5973307|-13.5628563|132.1370741|-1.6887404|10.7495597|161.3670472 unknown
InChI: InChI=1S/C14H23N3/c1-4-17(5-2)11-10-16-14(15)13-9-7-6-8-12(13)3/h6-9H,4-5,10-11,15H2,1-3H3
charge 0 multiplicity 1
40 atoms
N  3.745068 -0.035739 -0.240782
N  -0.039328 0.034685 -0.023436
N  -0.88906 -0.551216 2.152674
C  2.334132 0.157119 -0.662275
C  4.685361 0.923907 -0.877347
C  4.185903 -1.451504 -0.360226
C  1.342093 -0.135428 0.480323
C  4.593201 2.337519 -0.271149
C  5.326572 -1.814824 0.610227
C  -2.459537 0.002807 0.359583
C  -1.036554 -0.181333 0.806706
C  -2.922592 -0.445526 -0.917687
C  -3.362461 0.656383 1.242542
C  -4.283877 -0.221039 -1.249491
C  -2.026675 -1.151574 -1.918612
C  -4.710049 0.876048 0.888558
C  -5.174637 0.430718 -0.368085
H  2.062891 -0.474793 -1.541617
H  2.183185 1.204565 -0.976916
H  5.712656 0.544492 -0.725765
H  4.528606 0.976748 -1.985047
H  3.314195 -2.094216 -0.134439
H  4.490422 -1.696869 -1.410151
H  1.512961 -1.169046 0.867749
H  1.574674 0.559551 1.319663
H  3.583463 2.769714 -0.393392
H  4.818318 2.301236 0.809085
H  5.312223 3.0195 -0.76306
H  6.234994 -1.21443 0.421697
H  5.010915 -1.631707 1.652277
H  5.602548 -2.880866 0.502911
H  -2.990466 1.03355 2.20251
H  -4.648634 -0.569434 -2.223285
H  -1.267643 -0.457552 -2.317447
H  -1.460313 -1.9757 -1.448992
H  -2.623971 -1.560671 -2.752508
H  -5.3834 1.394509 1.579919
H  -6.218507 0.589425 -0.661476
H  0.035545 -0.628158 2.569284
H  -1.695517 -0.833647 2.703977
