program: Gaussian 09
title: 000244028
version: EM64L-G09RevD.01
frameworkgroup: C1[X(C9H8N2O3)]
method: RPBEPBE
basis: SDD
operation: Freq
keyword: #pfreq=noraman
keyword: PBEPBE/SDD
title: #p freq=noraman PBEPBE/SDD
converged: NO NO NO NO
title: Mulliken charges:
elementType: O O O N N C C C C C C C C C H H H H H H H H
charge: -0.289222 -0.205923 -0.206686 -0.109483 0.026046 -0.307263 -0.485189 0.111961 0.336659 -0.337967 -0.324657 0.385168 -0.349359 -0.350862 0.236204 0.236214 0.245338 0.245329 0.285112 0.280325 0.289483 0.288768
chargesum: 0.00000
title: Mulliken charges with hydrogens summed into heavy atoms:
elementType: O O O N N C C C C C C C C C
charge: -0.289222 -0.205923 -0.206686 -0.109483 0.026046 0.165156 0.005478 0.111961 0.336659 -0.052854 -0.044332 0.385168 -0.059876 -0.062094
polarizability: 2.20115121e+02 -6.60088314e+00 1.23114562e+02 -2.09677763e-03 -1.42015300e-03 5.49072788e+01
1716.lowfreq: 0.0006 0.0008 0.0008 2.1906 6.4670 20.6128 55.0018 59.9846 75.9120
frequency: 54.9026 59.9638 75.8151 107.3534 111.0141 167.5611 238.2563 258.5637 298.5182 410.6567 423.5619 467.6418 479.3591 512.1482 623.0531 633.0088 671.3482 687.9040 718.2596 748.1409 785.6905 813.2289 843.5923 862.2876 883.8815 900.8789 936.5352 953.6189 1000.9074 1000.9507 1009.4266 1022.9321 1076.9342 1088.4973 1109.1187 1156.1745 1176.9826 1205.1469 1212.7558 1250.7233 1295.8353 1306.7529 1330.4325 1360.3817 1404.2050 1414.7869 1464.7855 1478.6666 1487.0550 1588.2739 1605.1389 1618.6739 3014.4878 3035.7098 3064.9261 3108.3826 3167.9963 3172.6136 3189.1037 3192.2524
redmass: 5.2123 5.8552 4.5782 2.7362 6.0655 4.5908 7.4073 9.5589 5.3695 2.9029 6.9201 3.8196 7.6285 6.4779 7.1073 5.5509 4.2670 8.7198 6.9127 4.8360 9.6752 1.1936 11.4068 1.2422 1.6310 7.7926 3.6670 5.8903 1.3373 4.9812 1.3625 3.4833 1.6203 3.2483 1.3010 1.1019 1.3270 1.0971 5.3860 2.1334 1.2637 1.3358 1.8257 8.3023 11.4531 3.6554 1.1663 2.2864 1.0923 8.1372 7.7509 7.1049 1.0587 1.0583 1.1072 1.1113 1.0901 1.0894 1.0959 1.0973
irintensity: 0.2074 0.0250 0.1065 0.8324 0.4024 13.1823 5.8250 0.0668 3.0191 0.0000 8.2490 0.6685 7.3225 0.2864 0.1184 10.1851 40.9368 4.1652 8.5851 0.0915 26.8981 0.3137 7.8399 0.4502 66.4267 70.3974 1.1565 22.4393 0.2221 56.2693 0.0044 65.1881 0.0027 20.5182 13.7895 0.9822 44.3843 0.2093 364.1150 49.5919 0.0006 1.8913 42.7368 90.4378 3.8648 63.3333 3.1785 12.2389 6.7561 33.2024 32.0236 8.7312 31.2144 60.4882 5.7153 32.0271 0.8372 0.4019 0.2427 1.4473
temp: 298.150 k
press: 1.00000 atm
elementType: 8 8 8 7 7 6 6 6 6 6 6 6 6 6 1 1 1 1 1 1 1 1
symmnumber: 1
zpe: 420713.2 jmol-1
zpe.correction: 0.160241 hartree
zpe.thermalcorrener: 0.171840 hartree
zpe.thermalcorrenthalpy: 0.172784 hartree
zpe.thermalcorrgfe: 0.121197 hartree
zpe.sumelectzpe: -681.829566 hartree
zpe.sumelectthermal: -681.817968 hartree
zpe.sumelectthermalent: -681.817024 hartree
zpe.sumelectthermalfe: -681.868611 hartree
dipole: -6.9970 -0.6610 -0.0007
dipole: 7.0282
quadrupole: -85.1731 -80.5218 -80.0878
quadrupole: 3.0146 -0.0044 -0.0137
quadrupole: -3.2456 1.4058 1.8398 3.0146 -0.0044 -0.0137
hfenergy: -681.9898074 hartree
pointgroup: C01 [X(C9H8N2O3)]
dipole: -2.7495325 -0.292217 -0.0220103 debye
dipolederiv: -0.9798628 -0.3660346 -0.0189431 -0.2752247 -0.8111543 -0.0270642 -0.0148563 -0.0272077 -0.2354469 -0.8040145 -0.1926093 -0.0106202 -0.2699039 -0.6519329 -0.0202845 -0.0142662 -0.0203334 -0.2291978 -0.8049058 0.2080689 0.0078403 0.2785133 -0.6732058 -0.0199023 0.0106702 -0.0195369 -0.2295877 -0.5291896 0.1128017 0.0044556 -0.0200633 -0.6054961 -0.0124406 -0.0014366 -0.0120082 -0.3331464 2.0381763 -0.0317363 0.0042953 -0.00696 1.0875634 0.0416572 0.0054194 0.0412019 0.1936808 0.5384997 0.2084863 0.0100777 0.0154066 0.0766883 -0.0120852 0.0014047 -0.0114375 0.3436413 0.188685 -0.0732025 -0.003493 0.0310432 0.1054947 -0.0063806 0.0010614 -0.0066976 0.2479969 0.8793375 0.1683908 0.0101012 0.5689794 0.9918735 0.0421915 0.0284739 0.0407048 0.1045932 0.1995243 -0.0821734 -0.0031991 -0.138398 0.0771011 0.0011024 -0.0058267 0.0012625 0.0411656 -0.2786681 -0.1591765 -0.0075925 -0.1386646 0.0186944 0.0053006 -0.0068194 0.0053317 -0.1096418 -0.2178005 0.1965956 0.0084579 0.1781315 -0.0175502 0.0051438 0.0075775 0.0052616 -0.1218071 -0.8384451 0.0267005 -0.0016614 0.015087 0.0847293 0.0009792 -0.0019813 0.001117 0.0570427 0.185069 0.1462607 0.0074144 -0.166472 -0.0400581 0.0023728 -0.0066001 0.0034684 -0.1055019 0.1671155 -0.1688827 -0.0067177 0.1246791 -0.045474 0.0029602 0.0068701 0.0021029 -0.1037425 -0.019981 -0.0638815 0.0438908 -0.0596124 0.0349507 0.0685783 0.1097632 0.0990035 -0.0454059 -0.0189907 -0.0590501 -0.0492462 -0.0490099 0.0494256 -0.0602506 -0.1145017 -0.0907314 -0.06094 -0.0421304 0.0627319 -0.0618846 -0.0295926 0.0565764 0.061281 -0.1441559 0.078986 -0.0265865 -0.043297 0.0573171 0.0672359 -0.0422114 0.068534 -0.0528957 0.140833 -0.0700394 -0.0374102 0.0959699 0.0638042 0.0026557 0.0478247 0.0364342 -0.0049928 0.0019093 -0.0049886 0.1522099 0.0947532 -0.0539553 -0.0025886 -0.0668579 0.0280678 -0.0058951 -0.0032398 -0.0058645 0.1565936 0.0941268 -0.057761 -0.0028021 -0.0221275 0.0655691 -0.0047119 -0.0011352 -0.0049451 0.1708039 0.0960282 0.0573056 0.0023239 0.0254335 0.0631692 -0.0046635 0.0008366 -0.0046499 0.1706867 unknown
polarizability: 220.2573373|-5.4582452|122.8350538|0.2684065|3.0360757|55.04457 unknown
InChI: InChI=1S/C9H8N2O3/c12-11(13)8-3-1-7(2-4-8)9-10-5-6-14-9/h1-4H,5-6H2
charge 0 multiplicity 1
22 atoms
O  -2.785171 -1.190005 -0.06815
O  4.238017 1.127231 0.059767
O  4.215755 -1.154723 -0.045361
N  -2.883417 1.140084 0.037031
N  3.621808 -0.007681 0.004952
C  -4.254715 -0.881127 -0.058767
C  -4.311056 0.684273 0.012127
C  -2.13317 0.069702 -0.009184
C  -0.659974 0.036839 -0.00592
C  0.062069 1.260355 0.050641
C  0.035507 -1.200488 -0.058566
C  2.134431 0.007757 0.001328
C  1.467277 1.252578 0.05459
C  1.443067 -1.220951 -0.055211
H  -4.688224 -1.382076 0.821842
H  -4.682439 -1.300087 -0.983885
H  -4.816825 1.129259 -0.862558
H  -4.821927 1.048158 0.920695
H  -0.499337 2.198251 0.090644
H  -0.535089 -2.131975 -0.101628
H  2.051044 2.175261 0.097453
H  2.008268 -2.155333 -0.09504
