program: Gaussian 09
title: 000244044
version: EM64L-G09RevD.01
frameworkgroup: C1[X(C19H20N2)]
method: RPBEPBE
basis: SDD
operation: Freq
keyword: #pfreq=noraman
keyword: PBEPBE/SDD
title: #p freq=noraman PBEPBE/SDD
converged: YES YES NO NO
title: Mulliken charges:
elementType: N N C C C C C C C C C C C C C C C C C C C H H H H H H H H H H H H H H H H H H H H
charge: -0.311593 -0.194113 -0.528707 0.391306 0.402491 0.424608 -0.422178 -0.422859 0.410358 -0.800869 -0.802274 -0.366300 -0.387723 -0.367569 -0.384534 -0.237710 -0.217559 -0.253554 -0.227094 -0.266815 -0.239962 0.235885 0.257166 0.246110 0.246473 0.253162 0.225564 0.239051 0.249617 0.233567 0.235864 0.253607 0.274925 0.261244 0.228082 0.223088 0.224226 0.230965 0.226797 0.227496 0.229764
chargesum: 0.00000
title: Mulliken charges with hydrogens summed into heavy atoms:
elementType: N N C C C C C C C C C C C C C C C C C C C
charge: -0.311593 -0.194113 -0.035656 0.391306 0.402491 0.424608 -0.176068 -0.176386 0.410358 -0.083092 -0.083225 -0.112693 -0.112798 -0.106325 -0.156452 -0.014622 0.006667 -0.022589 -0.000298 -0.039319 -0.010198
polarizability: 2.43458288e+02 2.11358176e+00 2.14905401e+02 -3.73567244e+00 6.64354083e+00 1.76826250e+02
1716.lowfreq: -9.8076 -8.3566 -5.0104 -0.0004 -0.0003 0.0006 10.0098 37.8633 48.9333
frequency: 9.7498 37.8245 48.8720 58.7119 62.0928 71.5069 107.8809 138.1709 142.4505 153.3163 175.3924 187.7760 229.0110 252.0056 283.7678 286.2771 320.5351 365.8830 372.4181 404.7536 411.2161 456.4408 484.5726 515.1617 549.2469 575.2305 598.4358 612.5312 615.9160 622.6965 638.2121 692.8678 697.0704 707.7432 718.8242 735.2347 753.7020 770.6524 785.7236 823.5479 828.3047 838.7209 856.6964 885.8869 912.9931 957.5518 962.4691 967.4798 978.3389 979.6102 982.0555 990.1238 994.1263 1008.1185 1022.7897 1027.7315 1032.5003 1036.7427 1043.1370 1049.6542 1063.8858 1088.2232 1101.4453 1171.9177 1172.6481 1188.9508 1196.4782 1198.3621 1211.7591 1220.6283 1254.9148 1287.6456 1303.1072 1327.3688 1333.8512 1347.8827 1356.4845 1383.8048 1389.5979 1392.5733 1403.3646 1407.2266 1438.4962 1445.8628 1455.8760 1462.0707 1463.8133 1475.3913 1478.6693 1485.1855 1487.7100 1546.6917 1584.3522 1587.5850 1594.0762 1614.2608 1617.0563 2936.7425 2964.1937 2971.5325 3034.1399 3044.1573 3047.6752 3092.9987 3093.3435 3109.9982 3126.0697 3127.1681 3133.8258 3139.9706 3154.0262 3156.2166 3160.9578 3167.7851 3170.7307 3200.1864 3220.1872
redmass: 4.3558 3.7748 4.0926 4.3532 3.8029 3.7906 1.1307 1.2026 2.5097 2.9499 4.2482 3.9100 2.9299 2.9579 3.3009 4.1115 4.1929 3.1676 4.5460 2.8371 2.9725 2.7877 3.0529 3.2156 5.1246 4.9510 4.8905 6.2420 6.3747 3.2079 5.3556 2.1219 3.6971 2.6421 3.8996 1.5330 1.6789 1.2262 4.5929 1.5969 2.0224 1.3254 1.2543 1.4330 1.3978 2.2156 1.4164 1.6287 3.0758 1.5882 1.4028 5.9182 1.4285 1.9614 2.3875 2.1966 1.9529 1.4201 1.4210 1.4559 2.4491 1.6469 1.8123 1.0515 1.0522 1.1256 1.1740 2.5659 2.3431 1.4012 2.0244 2.7452 1.7419 1.5325 1.6621 4.8761 1.9014 7.2455 4.2894 3.8505 1.2448 1.2472 2.1119 1.9481 1.2542 1.0522 1.0540 1.0976 1.2173 2.1430 2.3728 5.4957 6.2738 5.6637 6.0440 6.0323 5.8847 1.0684 1.0399 1.0386 1.0967 1.0975 1.0918 1.0963 1.0967 1.0878 1.0847 1.0864 1.0890 1.0925 1.0924 1.0954 1.0947 1.0992 1.1004 1.0927 1.1035
irintensity: 0.0213 0.0417 0.0659 0.0395 0.1472 0.1005 0.0461 0.1549 1.4062 1.4327 1.0303 1.1271 1.1733 4.0803 0.0636 4.1693 5.2582 2.7149 9.4270 0.2686 0.0795 7.5599 6.0039 8.1150 10.2500 1.9509 4.9839 0.5260 0.7609 0.0200 0.7743 32.7342 1.7830 39.6133 16.3605 36.5145 81.7618 71.9568 4.8367 3.4027 7.9331 0.0443 0.1063 4.8456 0.3155 3.6851 0.2818 0.0503 1.7004 0.0769 0.6196 0.1670 2.3542 20.7338 0.2493 12.7717 4.4963 13.3562 0.6405 9.3316 7.3520 5.2919 8.7320 0.1485 0.0309 4.8459 4.0151 0.3058 25.3930 5.6423 27.2890 61.0715 8.7547 20.3809 26.3742 2.6403 10.9190 14.8299 5.7225 31.9035 15.2663 4.5584 11.5927 5.9994 9.8323 11.7154 13.6951 10.8026 9.0276 18.7295 114.9426 3.4820 3.4936 5.1078 0.9410 93.2839 37.2539 21.2514 50.8522 31.4569 18.7026 16.3340 9.1413 11.0385 34.5943 9.2312 3.6171 0.2698 11.7369 23.6199 41.4242 30.8056 16.0125 11.2331 10.1287 8.7464 5.9074
temp: 298.150 k
press: 1.00000 atm
elementType: 7 7 6 6 6 6 6 6 6 6 6 6 6 6 6 6 6 6 6 6 6 1 1 1 1 1 1 1 1 1 1 1 1 1 1 1 1 1 1 1 1
symmnumber: 1
zpe: 887746.2 jmol-1
zpe.correction: 0.338125 hartree
zpe.thermalcorrener: 0.357360 hartree
zpe.thermalcorrenthalpy: 0.358304 hartree
zpe.thermalcorrgfe: 0.288460 hartree
zpe.sumelectzpe: -843.996851 hartree
zpe.sumelectthermal: -843.977616 hartree
zpe.sumelectthermalent: -843.976671 hartree
zpe.sumelectthermalfe: -844.046515 hartree
dipole: 1.3384 0.2784 -0.9490
dipole: 1.6642
quadrupole: -117.4806 -125.7410 -117.4255
quadrupole: -1.1484 -0.5605 2.2668
quadrupole: 2.7351 -5.5253 2.7902 -1.1484 -0.5605 2.2668
hfenergy: -844.3349753 hartree
pointgroup: C01 [X(C19H20N2)]
dipole: 0.4529379 0.0615581 -0.4687838 debye
polarizability: 240.1291896|1.948871|216.0031209|-15.1360016|1.0263458|179.057629 unknown
InChI: InChI=1S/C19H20N2/c1-16-13-14-17(2)21(16)20(19-11-7-4-8-12-19)15-18-9-5-3-6-10-18/h3-14H,15H2,1-2H3
charge 0 multiplicity 1
41 atoms
N  -1.20532 -1.209921 0.345934
N  -0.415798 -0.183292 -0.201442
C  0.56084 -0.589653 -1.233252
C  -2.341188 -1.774593 -0.285835
C  -1.005052 -1.785655 1.621072
C  -0.90281 1.150059 -0.098915
C  -2.849252 -2.725932 0.602472
C  -2.02118 -2.731529 1.786495
C  2.038937 -0.387282 -0.881551
C  -2.80421 -1.334744 -1.645167
C  0.113692 -1.365796 2.528292
C  -0.248041 2.212544 -0.786017
C  -2.035001 1.447342 0.712957
C  2.459173 0.359137 0.244544
C  3.020765 -0.958376 -1.731678
C  -0.731763 3.533184 -0.670665
C  -2.500147 2.773478 0.819468
C  3.83623 0.533507 0.514985
C  4.396049 -0.786745 -1.462557
C  -1.858968 3.828849 0.128692
C  4.809484 -0.037345 -0.335696
H  0.3376 -0.052523 -2.180789
H  0.385174 -1.66187 -1.430202
H  -3.724111 -3.348573 0.418319
H  -2.1505 -3.3606 2.666353
H  -3.018841 -0.249707 -1.680541
H  -2.062297 -1.549516 -2.439604
H  -3.731112 -1.871854 -1.905704
H  1.107533 -1.525121 2.070189
H  0.046909 -0.294895 2.801661
H  0.069031 -1.955353 3.459039
H  0.644138 2.021323 -1.389526
H  -2.54445 0.641035 1.249049
H  1.708893 0.802964 0.906105
H  2.708528 -1.54467 -2.606045
H  -0.21372 4.336491 -1.207125
H  -3.374032 2.980766 1.447757
H  4.146222 1.116408 1.389657
H  5.142429 -1.238612 -2.125683
H  -2.226668 4.856462 0.215325
H  5.876139 0.096911 -0.124171
