program: Gaussian 09
title: 000020887
version: EM64L-G09RevD.01
frameworkgroup: C1[X(C11H22N2O)]
method: RPBEPBE
basis: SDD
operation: Freq
keyword: #p
keyword: freq=noraman
keyword: PBEPBE/SDD
title: #p freq=noraman PBEPBE/SDD
converged: YES YES NO NO
title: Mulliken charges:
elementType: O N N C C C C C C C C C C C H H H H H H H H H H H H H H H H H H H H H H
charge: -0.293255 -0.178329 -0.178326 -0.374188 -0.374188 -0.374119 -0.374116 0.257986 -0.351772 -0.351768 -0.335100 -0.335101 -0.694316 -0.694315 0.221887 0.221209 0.221885 0.221213 0.202137 0.244368 0.202134 0.244370 0.218697 0.185873 0.218694 0.185877 0.188983 0.203292 0.188983 0.203289 0.216497 0.207118 0.215392 0.216497 0.207119 0.215393
chargesum: 0.00000
title: Mulliken charges with hydrogens summed into heavy atoms:
elementType: O N N C C C C C C C C C C C
charge: -0.293255 -0.178329 -0.178326 0.068908 0.068910 0.072386 0.072388 0.257986 0.052798 0.052803 0.057174 0.057172 -0.055308 -0.055306
polarizability: 1.73232094e+02 -2.25083797e-04 1.25817686e+02 -5.34867492e+00 8.88163515e-04 1.07972662e+02
1716.lowfreq: -19.3678 -9.0885 -3.8032 0.0006 0.0007 0.0008 13.9102 16.7494 54.2339
frequency: 9.9505 10.1126 54.2077 58.0504 68.9323 70.1982 103.4587 108.3135 155.7227 156.2318 199.8194 210.1107 214.9356 219.2321 262.0748 295.4746 301.4230 336.8328 405.4902 415.8236 538.8860 640.7259 645.7242 702.3282 731.4683 734.0698 742.9259 782.8976 783.3935 846.3859 898.0421 898.5561 917.9258 923.0435 976.1116 976.6936 1007.0302 1021.3402 1065.4672 1069.6649 1069.8871 1100.7474 1105.4148 1115.3742 1120.9332 1168.0368 1180.9456 1205.1574 1205.7255 1240.5347 1250.8312 1263.8050 1264.6369 1267.4023 1284.6480 1287.4569 1293.5095 1316.2326 1317.0713 1342.9429 1343.6076 1359.5392 1364.1654 1383.5928 1388.7205 1388.8842 1420.3702 1449.6360 1454.7292 1468.0473 1468.0704 1475.0135 1475.0178 1475.9109 1475.9240 1486.8607 1486.9610 1497.1367 1499.9126 1651.3347 2943.7548 2946.6309 2963.6462 2963.6613 2968.9725 2969.5715 2972.6885 2972.9577 2975.4947 2975.5849 3008.2100 3008.2128 3028.7060 3032.9767 3033.0915 3040.1605 3057.9280 3058.1028 3069.5093 3069.6186 3072.9269 3072.9683
redmass: 3.1966 3.2409 2.8812 1.5649 3.9780 2.1934 2.3638 2.3026 1.8534 3.6940 2.8633 2.3490 1.1935 1.3418 2.2057 3.5461 4.2740 3.5408 2.8697 2.9459 3.9724 5.8603 3.5227 11.3542 1.2253 1.0821 3.0733 1.2060 1.2474 1.4403 1.7466 1.7294 1.2934 1.2687 2.9569 2.0614 4.2098 3.0840 2.2894 2.5249 2.5057 1.6837 2.3402 2.1892 2.0928 1.6048 1.3504 1.4407 1.6819 1.8187 1.4468 1.7379 1.3201 1.3254 1.1936 1.0746 1.4854 2.0016 1.3733 1.4533 1.4880 1.3873 1.3557 1.6994 1.2157 1.2269 2.1431 1.0884 1.1232 1.0734 1.0723 1.0456 1.0457 1.0598 1.0602 1.0849 1.0848 1.1397 1.0927 9.4544 1.0718 1.0630 1.0585 1.0586 1.0609 1.0603 1.0382 1.0383 1.0639 1.0650 1.0968 1.0969 1.0923 1.0987 1.0986 1.1002 1.1019 1.1018 1.1006 1.1007 1.0998 1.0998
irintensity: 0.0234 0.5872 5.8370 0.0423 0.0151 1.2328 0.0582 1.4788 0.3196 0.5260 0.2568 4.0673 0.0444 0.7777 0.3010 16.8481 2.6139 4.3709 8.5346 0.6437 1.5361 5.5312 24.2059 15.8780 9.0974 3.9798 11.9082 0.3784 0.3448 4.9734 8.1979 2.4366 8.2757 0.3543 11.0769 0.3755 1.2652 9.4670 19.3900 1.0253 1.0392 1.0635 52.5190 0.1666 0.3443 0.3278 4.6198 6.3940 4.3356 89.0319 4.7381 279.1922 0.4563 0.3188 0.4600 4.9328 1.4757 10.1117 11.4225 0.8394 1.4815 0.0854 30.7590 0.0737 17.7592 0.1027 191.6773 14.7442 44.3129 0.4003 0.0449 4.3526 18.7777 7.9310 2.2752 21.8160 5.2701 57.2776 5.6823 287.1079 46.2826 66.4674 17.7387 1.2914 6.6391 26.4573 74.5323 2.7802 201.3405 7.9151 3.3579 7.5669 36.4437 16.5490 20.9048 51.2138 2.1240 12.0368 1.0499 175.4667 120.5008 5.0962
temp: 298.150 k
press: 1.00000 atm
elementType: 8 7 7 6 6 6 6 6 6 6 6 6 6 6 1 1 1 1 1 1 1 1 1 1 1 1 1 1 1 1 1 1 1 1 1 1
symmnumber: 1
zpe: 838457.7 jmol-1
zpe.correction: 0.319352 hartree
zpe.thermalcorrener: 0.336417 hartree
zpe.thermalcorrenthalpy: 0.337361 hartree
zpe.thermalcorrgfe: 0.270536 hartree
zpe.sumelectzpe: -615.970227 hartree
zpe.sumelectthermal: -615.953161 hartree
zpe.sumelectthermalent: -615.952217 hartree
zpe.sumelectthermalfe: -616.019042 hartree
dipole: -0.0001 4.1950 0.0007
dipole: 4.1950
quadrupole: -79.5195 -88.8395 -87.6459
quadrupole: 0.0004 -2.7471 -0.0004
quadrupole: 5.8154 -3.5045 -2.3109 0.0004 -2.7471 -0.0004
hfenergy: -616.2895785 hartree
pointgroup: C01 [X(C11H22N2O1)]
dipole: 0.000125 -1.6504281 0.0002519 debye
polarizability: 173.3349628|0.0063187|125.8176859|4.6780869|-0.0043157|107.8697936 unknown
InChI: InChI=1S/C11H22N2O/c1-3-5-7-12-9-10-13(11(12)14)8-6-4-2/h3-10H2,1-2H3
charge 0 multiplicity 1
36 atoms
O  -0.000084 1.658769 -0.000981
N  1.003189 -0.441903 0.522005
N  -1.003038 -0.442312 -0.522889
C  0.760106 -1.852873 0.172504
C  -0.759675 -1.853091 -0.172848
C  2.3039 0.082332 0.942469
C  -2.303776 0.081482 -0.943796
C  0.0000 0.392472 -0.000644
C  3.396488 0.05129 -0.156048
C  -3.396509 0.050715 0.154583
C  4.73985 0.621132 0.353597
C  -4.739929 0.620025 -0.355502
C  5.845946 0.598516 -0.723085
C  -5.846145 0.597724 0.721063
H  0.994772 -2.526652 1.016298
H  1.366486 -2.166262 -0.703718
H  -0.994206 -2.527244 -1.016383
H  -1.365996 -2.166265 0.703491
H  2.6505 -0.484369 1.830712
H  2.131288 1.128632 1.255658
H  -2.650144 -0.485687 -1.831833
H  -2.131321 1.127673 -1.257434
H  3.045778 0.641799 -1.024854
H  3.554027 -0.988178 -0.510939
H  -3.046041 0.641698 1.023164
H  -3.55386 -0.988625 0.509932
H  5.07257 0.041359 1.239403
H  4.583008 1.661844 0.702434
H  -5.072427 0.039741 -1.241056
H  -4.583263 1.660595 -0.704844
H  6.793856 1.01754 -0.338259
H  6.046927 -0.43456 -1.065017
H  5.547996 1.192163 -1.607567
H  -6.794106 1.016325 0.335903
H  -6.04693 -0.435216 1.063518
H  -5.548437 1.191908 1.605265
