program: Gaussian 09
title: 000244010
version: EM64L-G09RevD.01
frameworkgroup: C1[X(C15H22)]
method: RPBEPBE
basis: SDD
operation: Freq
keyword: #p
keyword: freq=noraman
keyword: PBEPBE/SDD
title: #p freq=noraman PBEPBE/SDD
converged: YES YES NO NO
title: Mulliken charges:
elementType: C C C C C C C C C C C C C C C H H H H H H H H H H H H H H H H H H H H H H
charge: -0.184593 -0.449440 -0.449172 -0.401034 -0.401037 -0.382840 0.359882 0.322126 -0.235265 -0.396005 -0.393102 -0.279866 -0.703636 -0.703344 -0.279798 0.181886 0.213679 0.197003 0.197474 0.213913 0.191682 0.200733 0.200809 0.191492 0.188432 0.198800 0.200362 0.228143 0.227468 0.222761 0.212145 0.212829 0.224638 0.224626 0.212770 0.212453 0.223027
chargesum: 0.00000
title: Mulliken charges with hydrogens summed into heavy atoms:
elementType: C C C C C C C C C C C C C C C
charge: -0.002707 -0.038758 -0.037786 -0.008618 -0.008736 0.004391 0.359882 0.322126 -0.034903 -0.167861 -0.165634 -0.057105 -0.054023 -0.053495 -0.056772
polarizability: 1.86748031e+02 -3.69359375e+00 1.65266270e+02 1.32096696e-01 -2.77984976e-02 1.16872476e+02
1716.lowfreq: -31.8319 -28.2711 -9.3929 0.0003 0.0007 0.0009 14.8005 34.3842 68.8169
frequency: -28.4647 32.8650 67.9263 78.7767 131.4448 172.8017 207.9104 222.2396 225.8651 235.9285 259.3443 280.3377 303.1808 349.9265 356.0328 426.9922 449.4955 472.6759 500.0640 520.0129 556.5348 571.5509 621.0349 729.2159 763.9194 770.2288 771.5147 783.5738 824.7757 854.9303 873.0787 888.2498 892.4390 893.4347 912.5478 918.3492 951.7967 955.9919 985.8345 989.3291 1030.6055 1044.7567 1050.2562 1057.7590 1069.8242 1074.5400 1108.5087 1114.3837 1135.1235 1160.2260 1177.2921 1180.5545 1184.2556 1220.7373 1236.2138 1256.7550 1262.1677 1277.4040 1298.5096 1302.2572 1305.4781 1322.4999 1325.7147 1332.5581 1341.7139 1341.7686 1350.9349 1376.4738 1387.5454 1397.0610 1434.5879 1460.3089 1461.0417 1463.4591 1464.4058 1468.5357 1470.6726 1475.1064 1478.4682 1479.7192 1490.0296 1581.4933 1611.7920 2962.5148 2963.2366 2964.9964 2968.7935 2970.6335 2971.4335 2974.0623 2988.2402 3014.1739 3022.9011 3025.9387 3031.1780 3033.3958 3044.6446 3064.2695 3072.2923 3073.6686 3079.2869 3112.3351 3118.8485 3134.9632 3155.8372
redmass: 2.5528 3.0186 3.4527 3.1366 3.1218 2.8582 1.1009 1.7584 1.9834 1.3878 3.0895 2.8602 2.4463 3.3473 1.8989 3.0394 2.6987 2.5297 1.9341 3.1008 3.4704 2.9216 4.6892 3.3326 1.8208 2.0058 2.6342 1.4477 3.4130 1.6927 1.4635 2.4078 2.5150 1.4667 1.1948 1.8422 1.4970 1.3718 1.3168 2.3710 1.9133 1.8475 1.3673 2.3041 1.2709 1.8334 2.5132 2.5997 2.2565 1.9257 1.0772 1.4558 1.4776 2.2767 1.4813 1.2920 1.4741 1.6957 1.2837 1.4938 1.2934 1.5339 1.2974 1.3663 1.4732 1.5048 1.4974 1.1929 2.2928 1.3027 2.1492 1.0868 1.0932 1.0868 1.0475 1.0515 1.0985 1.4090 1.0964 1.1560 1.3379 6.2713 5.9681 1.0625 1.0622 1.0628 1.0619 1.0640 1.0349 1.0355 1.0801 1.0825 1.0968 1.0944 1.1008 1.1031 1.1026 1.1001 1.0990 1.1004 1.0991 1.0844 1.0877 1.0933 1.1006
irintensity: 0.0161 0.0385 0.0093 0.0311 0.6631 0.0051 0.0093 0.0910 0.1429 0.0574 0.1509 0.0085 0.9981 0.8231 0.2740 0.2522 0.1413 2.5488 0.6784 16.0200 0.6345 0.5674 1.5147 0.9034 44.7036 28.4456 0.6680 0.0796 2.3903 6.2216 0.9320 0.6209 1.0662 7.0472 2.1450 0.0593 0.0002 0.3478 0.0258 15.7808 21.8808 0.3033 0.2361 1.6461 0.1062 9.3967 0.0158 1.5077 5.5523 0.4490 0.0615 0.8414 5.2465 4.8963 0.0444 1.7872 5.5412 0.2644 1.4359 4.4433 0.5970 6.5168 0.1602 0.0493 0.6471 0.3734 0.2080 17.8309 3.3749 9.9647 4.4654 2.0995 6.1417 10.3646 0.0221 6.0995 17.7532 4.2795 8.3673 9.0319 35.5115 0.2982 2.9691 34.1446 40.2964 37.7572 18.3443 9.2631 35.7666 41.3507 19.8404 16.3548 92.0499 75.9374 5.2333 3.4670 126.7622 0.0168 101.7201 22.9131 48.6630 14.1042 5.7073 43.4888 32.3201
temp: 298.150 k
press: 1.00000 atm
elementType: 6 6 6 6 6 6 6 6 6 6 6 6 6 6 6 1 1 1 1 1 1 1 1 1 1 1 1 1 1 1 1 1 1 1 1 1 1
symmnumber: 1
zpe: 864979.6 jmol-1
zpe.correction: 0.329453 hartree
zpe.thermalcorrener: 0.343557 hartree
zpe.thermalcorrenthalpy: 0.344501 hartree
zpe.thermalcorrgfe: 0.288761 hartree
zpe.sumelectzpe: -583.651415 hartree
zpe.sumelectthermal: -583.637312 hartree
zpe.sumelectthermalent: -583.636368 hartree
zpe.sumelectthermalfe: -583.692108 hartree
dipole: 0.5112 -0.5941 -0.0037
dipole: 0.7838
quadrupole: -89.0552 -88.7890 -96.6058
quadrupole: 0.9867 0.0250 -0.0174
quadrupole: 2.4281 2.6943 -5.1225 0.9867 0.0250 -0.0174
hfenergy: -583.9808686 hartree
pointgroup: C01 [X(C15H22)]
dipole: 0.2247343 0.2045173 0.0524575 debye
polarizability: 187.2779243|1.4856828|161.7409974|-0.3590373|11.5783905|119.8678557 unknown
InChI: InChI=1S/C15H22/c1-12(2)14-10-6-7-11-15(14)13-8-4-3-5-9-13/h6-7,10-13H,3-5,8-9H2,1-2H3
charge 0 multiplicity 1
37 atoms
C  1.105844 0.090279 -0.041231
C  1.889678 -0.001275 -1.384391
C  1.900002 -0.630122 1.088618
C  3.322803 0.565412 -1.246462
C  3.332307 -0.062809 1.226632
C  4.103897 -0.140938 -0.112658
C  -0.326407 -0.441031 -0.165482
C  -1.495872 0.354706 0.054381
C  -1.461574 1.843299 0.437668
C  -0.494955 -1.810778 -0.516057
C  -2.772238 -0.257691 -0.087911
C  -1.765883 -2.40068 -0.652385
C  -2.111534 2.089873 1.826511
C  -2.131009 2.72674 -0.649969
C  -2.920321 -1.614007 -0.435493
H  1.079167 1.163229 0.231867
H  1.334018 0.539126 -2.175386
H  1.945475 -1.061589 -1.705402
H  1.956765 -1.714471 0.863169
H  1.352418 -0.534584 2.046387
H  3.266636 1.652123 -1.026368
H  3.863462 0.462226 -2.20755
H  3.88095 -0.609886 2.018079
H  3.275591 0.997374 1.551588
H  4.255558 -1.206572 -0.384121
H  5.110278 0.308031 -0.002593
H  -0.409651 2.172055 0.51435
H  0.395429 -2.428794 -0.684892
H  -3.672132 0.347192 0.078765
H  -1.856955 -3.45855 -0.923769
H  -3.184239 1.821699 1.820757
H  -2.032772 3.156851 2.107807
H  -1.618991 1.486649 2.610602
H  -1.648994 2.581923 -1.633793
H  -2.057474 3.797155 -0.380393
H  -3.203122 2.480381 -0.76194
H  -3.919656 -2.052446 -0.53604
