program: Gaussian 09
title: 000244006
version: EM64L-G09RevD.01
frameworkgroup: C1[X(C11H14Br2)]
method: RPBEPBE
basis: SDD
operation: Freq
keyword: #p
keyword: freq=noraman
keyword: PBEPBE/SDD
title: #p freq=noraman PBEPBE/SDD
converged: YES YES NO NO
title: Mulliken charges:
elementType: Br Br C C C C C C C C C C C H H H H H H H H H H H H H H
charge: -0.027632 -0.049687 -0.209421 -0.050215 0.501719 -0.745284 -0.726719 -0.686588 -0.389091 -0.435603 -0.246925 -0.224739 -0.242728 0.236588 0.248688 0.212566 0.241439 0.219181 0.295288 0.304713 0.303141 0.310197 0.228313 0.245842 0.226422 0.229724 0.230812
chargesum: 0.00000
title: Mulliken charges with hydrogens summed into heavy atoms:
elementType: Br Br C C C C C C C C C C C
charge: -0.027632 -0.049687 0.027167 0.198473 0.501719 -0.072099 -0.126718 -0.073249 -0.160778 -0.189760 -0.020503 0.004985 -0.011916
polarizability: 1.80732664e+02 -8.57003977e+00 1.42599813e+02 8.80291258e+00 1.50985576e+01 1.12084594e+02
1716.lowfreq: -7.0869 -3.9810 0.0003 0.0005 0.0006 5.9502 27.1980 38.1453 41.8181
frequency: 27.1568 38.1136 41.7525 69.6206 92.9352 164.9548 174.7054 193.7976 207.8765 232.1132 261.6009 311.8558 395.3270 403.8608 421.3058 489.6364 541.9852 565.7670 597.5031 615.7742 634.7108 706.8265 764.2118 776.0796 808.9500 853.5639 865.8717 890.0341 921.3475 976.2284 981.1825 990.4969 996.5604 1008.8163 1027.9008 1056.0879 1067.0640 1094.0648 1107.9196 1118.3860 1173.2293 1191.4286 1195.4195 1205.3048 1222.1324 1257.1453 1269.2150 1294.9892 1307.3099 1327.0618 1347.9884 1384.1655 1395.9523 1437.6940 1441.2260 1443.0722 1474.6164 1481.1858 1489.2571 1591.8757 1611.5635 2957.2506 2981.8240 3002.8474 3064.7070 3066.8560 3075.6300 3086.8956 3114.4105 3122.9420 3134.8950 3145.9679 3152.3978 3158.4589 3164.0562
redmass: 6.7308 6.6989 6.8667 5.5759 4.5557 4.4179 3.7349 2.7376 3.5416 1.6159 2.2879 2.5151 2.6487 2.7993 3.8010 3.7687 3.0450 3.9908 3.7037 6.3803 4.9335 1.6660 2.1678 2.5380 2.0845 1.2492 1.9595 1.5280 1.4384 1.4145 1.8852 4.9073 1.3249 1.9174 2.0279 2.2668 1.4153 1.7252 1.4239 1.7176 1.0586 1.1187 1.4991 1.4055 1.6617 1.2595 1.3082 1.4830 1.2981 1.4171 1.3723 4.8309 1.2111 1.1011 1.1006 2.0877 1.0969 1.7193 1.1696 5.8941 6.0567 1.0808 1.0369 1.0841 1.0602 1.0569 1.0967 1.0991 1.0869 1.0865 1.0910 1.0958 1.1106 1.1085 1.1014
irintensity: 0.0450 0.3678 0.5618 0.1486 0.0738 1.7250 4.3328 1.4905 0.4611 1.0429 5.0366 0.8579 0.2535 0.0912 5.1666 8.2656 20.0494 8.1510 22.3281 0.3132 21.0969 57.5293 34.9036 19.1132 13.3747 0.0500 34.4339 4.4094 3.5806 0.1901 2.7826 0.4245 0.2238 4.3919 6.5918 3.1754 14.4921 10.4501 8.1032 1.4143 0.0882 0.3458 3.6978 4.2232 1.2012 14.6437 47.0576 0.4104 10.1579 9.7735 0.2916 0.2645 16.1564 21.9592 12.2916 9.4763 1.8307 16.1947 21.5084 1.7499 6.7748 3.8604 25.1286 8.0628 7.5127 8.6599 42.5180 34.6793 10.4316 2.7374 10.7175 36.1432 1.3377 2.7532 23.1529
temp: 298.150 k
press: 1.00000 atm
elementType: 35 35 6 6 6 6 6 6 6 6 6 6 6 1 1 1 1 1 1 1 1 1 1 1 1 1 1
symmnumber: 1
zpe: 575792.1 jmol-1
zpe.correction: 0.219308 hartree
zpe.thermalcorrener: 0.233131 hartree
zpe.thermalcorrenthalpy: 0.234076 hartree
zpe.thermalcorrgfe: 0.175203 hartree
zpe.sumelectzpe: -453.512776 hartree
zpe.sumelectthermal: -453.498952 hartree
zpe.sumelectthermalent: -453.498008 hartree
zpe.sumelectthermalfe: -453.556881 hartree
dipole: -2.6893 -1.8682 0.6676
dipole: 3.3419
quadrupole: -100.8358 -99.0285 -94.1758
quadrupole: -0.4247 4.7231 1.7205
quadrupole: -2.8224 -1.0151 3.8376 -0.4247 4.7231 1.7205
hfenergy: -453.7320839 hartree
pointgroup: C01 [X(C11H14Br2)]
dipole: 1.0375345 0.7772088 -0.2193986 debye
polarizability: 181.6188146|-8.0894755|113.7369352|2.1400022|-17.9034757|140.0613215 unknown
InChI: InChI=1S/C11H14Br2/c1-9(11(7-12)8-13)10-5-3-2-4-6-10/h2-6,9,11H,7-8H2,1H3
charge 0 multiplicity 1
27 atoms
Br -4.410491 -0.093433 -1.083675
Br -1.784707 -2.170771 1.746019
C  -0.459715 0.837366 0.650471
C  -1.578744 0.107784 -0.188204
C  0.929509 0.376178 0.194163
C  -0.573231 2.384938 0.581911
C  -2.978711 0.613738 0.185817
C  -1.458945 -1.422566 -0.127031
C  1.416216 0.692191 -1.102409
C  1.76337 -0.371644 1.063486
C  2.700272 0.274757 -1.515661
C  3.050504 -0.790934 0.654176
C  3.523635 -0.469486 -0.638041
H  -0.589844 0.529401 1.706292
H  -1.402796 0.362351 -1.256772
H  -0.623251 2.744564 -0.463046
H  0.312584 2.84688 1.051302
H  -1.464549 2.759684 1.115692
H  -3.298282 0.27279 1.18258
H  -3.073369 1.702931 0.090098
H  -2.221324 -1.920135 -0.743563
H  -0.447108 -1.767483 -0.382259
H  0.795503 1.276344 -1.793579
H  1.397629 -0.632602 2.063982
H  3.060097 0.529603 -2.518999
H  3.678928 -1.368196 1.341598
H  4.520019 -0.793649 -0.958253
