program: Gaussian 09
title: 000244005
version: EM64L-G09RevD.01
frameworkgroup: C1[X(C10H14O)]
method: RPBEPBE
basis: SDD
operation: Freq
keyword: #pfreq=noraman
keyword: PBEPBE/SDD
title: #p freq=noraman PBEPBE/SDD
converged: YES YES NO NO
title: Mulliken charges:
elementType: O C C C C C C C C C C H H H H H H H H H H H H H H
charge: -0.459253 0.154574 0.258739 0.282083 -0.720478 -0.762750 -0.385447 -0.364927 -0.854470 -0.262617 -0.247047 0.227865 0.214167 0.254768 0.245751 0.210071 0.215880 0.246162 0.228362 0.218417 0.286241 0.227674 0.333613 0.225501 0.227122
chargesum: 0.00000
title: Mulliken charges with hydrogens summed into heavy atoms:
elementType: O C C C C C C C C C C
charge: -0.125640 0.154574 0.258739 0.282083 -0.023679 -0.091048 -0.139285 -0.136565 -0.122138 -0.037116 -0.019925
polarizability: 1.32446229e+02 -1.90772928e+00 1.19336955e+02 -1.32988218e+00 -4.27865429e-01 7.14468254e+01
1716.lowfreq: -11.0479 -0.0002 -0.0002 0.0004 11.7055 12.5502 85.8141 109.5460 166.9522
frequency: 85.7879 109.5348 166.9483 208.5526 220.3865 236.3423 296.1611 307.1504 327.9488 330.5108 352.1092 376.9444 401.3115 462.9411 473.5438 536.5265 559.4726 573.0678 675.3215 735.6700 766.6236 782.7292 831.2534 874.4421 917.4895 926.3752 951.0143 987.9086 993.0447 997.1929 1048.1354 1052.7295 1081.3095 1094.6581 1127.9568 1168.8667 1178.1575 1211.9203 1247.2110 1292.6373 1312.5271 1362.4393 1377.8700 1394.1472 1397.6342 1429.7889 1454.4466 1463.0143 1471.1474 1481.0277 1484.8362 1492.4567 1508.3654 1581.3271 1610.6237 2972.1802 2982.2859 3001.1808 3051.8980 3076.5903 3091.4212 3098.5601 3109.3132 3114.0654 3122.1970 3129.4984 3150.3680 3167.1478 3546.2865
redmass: 3.4472 3.2628 1.0462 1.0715 3.0085 3.1191 1.9461 2.2982 1.8536 1.3627 1.8257 2.6176 2.8382 2.7694 3.1659 4.3113 3.6167 3.8995 5.1744 2.1647 1.5761 4.1804 3.5827 1.3212 2.3666 1.4820 1.3864 1.3242 1.5217 1.3637 1.6140 2.1914 2.4888 1.6084 1.7147 1.7787 1.1853 2.3331 2.8251 1.4493 1.8528 7.9791 1.2460 1.2095 1.2176 2.0415 1.0958 1.1457 1.0941 1.2678 1.3974 1.1059 1.0646 6.0152 6.0208 1.0414 1.0365 1.0366 1.0936 1.0992 1.0999 1.0991 1.0977 1.0873 1.0980 1.0888 1.0948 1.0971 1.0658
irintensity: 0.6841 0.0009 4.5976 2.5153 2.3535 1.9817 41.2596 16.2232 3.3799 0.1790 99.2875 1.6789 2.7028 10.5421 6.6602 10.9701 2.1501 9.9158 2.6590 23.8702 49.1130 8.8111 15.1734 0.3841 20.4768 0.7195 0.2651 0.2038 1.8360 2.4560 12.6583 8.0723 31.6361 34.0367 37.1036 4.7110 2.0469 2.7257 43.2056 0.3801 52.1560 1.1369 21.1815 31.4081 18.4786 8.3479 5.7643 0.9945 12.2820 9.2196 22.9810 2.6980 18.6773 1.0406 2.3398 33.1278 17.9143 21.8436 31.9150 31.8729 2.3998 52.3087 0.5946 9.1582 19.3698 11.8138 33.9286 20.8320 5.1246
temp: 298.150 k
press: 1.00000 atm
elementType: 8 6 6 6 6 6 6 6 6 6 6 1 1 1 1 1 1 1 1 1 1 1 1 1 1
symmnumber: 1
zpe: 558671.2 jmol-1
zpe.correction: 0.212787 hartree
zpe.thermalcorrener: 0.224044 hartree
zpe.thermalcorrenthalpy: 0.224988 hartree
zpe.thermalcorrgfe: 0.177109 hartree
zpe.sumelectzpe: -463.845878 hartree
zpe.sumelectthermal: -463.834621 hartree
zpe.sumelectthermalent: -463.833677 hartree
zpe.sumelectthermalfe: -463.881556 hartree
dipole: 0.6225 -1.0448 -0.0602
dipole: 1.2177
quadrupole: -66.5756 -63.3369 -67.1035
quadrupole: 3.4953 -1.2513 0.9397
quadrupole: -0.9036 2.3351 -1.4315 3.4953 -1.2513 0.9397
hfenergy: -464.0586649 hartree
pointgroup: C01 [X(C10H14O1)]
dipole: -0.268007 0.3887761 -0.0808719 debye
dipolederiv: -0.7104911 -0.0759253 0.2284589 -0.1030683 -0.6027281 -0.1892869 0.2597237 -0.2087663 -0.4594137 0.6246294 0.0771002 -0.0873349 0.0847728 0.4846967 0.1121578 -0.1364595 0.1358256 0.5070257 0.0582014 0.021429 0.0520261 0.0088721 -0.1915002 -0.0045996 0.0141847 0.0050689 -0.1546234 -0.0237485 -0.1929033 0.0275557 -0.1455105 0.2632455 -0.0634101 0.0264786 -0.107282 -0.0190503 -0.0972049 -0.0069097 -0.0715576 0.0177721 -0.0014971 0.0838311 0.0059628 0.0256768 -0.0872352 -0.0769367 -0.1023292 0.033325 -0.0704276 -0.1321428 0.0095826 0.0293798 0.0670705 0.0149562 -0.0633326 0.0398746 -0.0021529 0.0279184 0.0257519 -0.0211116 0.016599 -0.0050912 -0.1442919 -0.0614955 0.1828793 -0.0253686 0.0798219 -0.000059 -0.017889 -0.0235865 -0.0136814 -0.1639568 -0.0623365 0.0704517 0.0449457 0.0819869 -0.1379241 0.0459506 0.0080231 0.1219418 0.0330175 -0.0683038 -0.0743621 0.0081371 -0.0918542 0.0356549 -0.0139055 0.0036228 -0.017341 -0.1599956 0.089352 0.0062316 0.0072236 0.0287827 -0.0120864 -0.0151923 0.0001626 -0.0092822 -0.1557095 -0.1929287 -0.0099498 -0.0300156 -0.0117326 0.104613 0.0049148 -0.012595 0.0036407 0.0795448 0.0844425 0.0593266 0.0557248 0.0320184 -0.0154115 -0.1229502 0.0403695 -0.0738065 -0.0170663 0.1087193 -0.0643265 0.0313245 -0.038508 -0.0872941 0.0905871 0.038065 0.0605151 0.0580052 -0.1644143 -0.029162 0.0178845 0.0362951 0.0933729 -0.0007248 0.0030305 0.0054161 0.1000652 0.0949927 0.0629812 0.0473072 0.023989 -0.0477454 -0.0949405 0.0427981 -0.1131858 -0.0272486 0.0730402 0.0396403 -0.1031263 0.0161161 0.035661 0.0509727 -0.0838587 0.069099 -0.1135695 0.0750957 -0.0862922 0.0061221 -0.0897128 -0.0690353 0.0226945 0.0083511 0.0148542 0.1265434 0.0295367 -0.0730658 0.0108187 -0.108537 -0.0938996 0.0229108 0.0130708 0.0169902 0.1417025 -0.0148611 -0.1512989 -0.0698988 -0.0531847 -0.0648192 -0.0472873 -0.0527679 -0.0904051 0.069018 0.0218709 0.0869582 0.0270403 0.0447729 0.131641 -0.0030571 0.0428601 -0.0462745 0.0873245 0.0924688 0.0525255 -0.0384575 0.0491082 0.0291931 0.0266977 -0.0591435 0.0744286 -0.1248349 0.3171835 0.0761481 -0.1560344 0.0775044 0.2448138 0.0910224 -0.1689359 0.0558909 0.0964874 0.0137504 0.0873918 -0.010178 0.1079056 -0.0793249 0.0259415 -0.0120089 0.0246583 0.1565591 -0.1472298 0.0035867 -0.0037695 -0.0051008 0.0868239 0.0070912 -0.0033261 0.0040394 0.1567461 unknown
polarizability: 132.5823992|-0.8527167|118.4006519|2.1796334|-5.9898931|72.2469582 unknown
InChI: InChI=1S/C10H14O/c1-8-6-4-5-7-9(8)10(2,3)11/h4-7,11H,1-3H3
charge 0 multiplicity 1
25 atoms
O  2.193825 -0.686557 -1.044998
C  1.622975 0.312226 -0.082865
C  0.074634 0.2368 -0.089103
C  -0.633325 -1.005452 0.048005
C  2.214345 -0.090526 1.28541
C  2.183336 1.696307 -0.488646
C  -0.68255 1.432154 -0.223946
C  -2.053129 -0.982906 0.027461
C  0.039294 -2.360464 0.235669
C  -2.093688 1.434475 -0.229141
C  -2.788493 0.21353 -0.104814
H  3.317034 -0.072721 1.229388
H  1.883134 0.617373 2.064957
H  1.902771 -1.104147 1.578731
H  3.28038 1.609072 -0.564856
H  1.952465 2.476849 0.258286
H  1.795672 2.027372 -1.470231
H  -0.163963 2.389409 -0.327504
H  -2.588874 -1.935976 0.121927
H  -0.590837 -3.16316 -0.187516
H  1.031286 -2.39411 -0.238588
H  0.167705 -2.587764 1.312476
H  1.811611 -0.496964 -1.940673
H  -2.639586 2.378827 -0.333406
H  -3.884023 0.190253 -0.114023
