program: Gaussian 09
title: 000244063
version: EM64L-G09RevD.01
frameworkgroup: C1[X(C22H26N4O4S)]
method: RPBEPBE
basis: SDD
operation: Freq
keyword: #p
keyword: freq=noraman
keyword: PBEPBE/SDD
title: #p freq=noraman PBEPBE/SDD
converged: YES YES NO NO
title: Mulliken charges:
elementType: S O O O O N N N N C C C C C C C C C C C C C C C C C C C C C C H H H H H H H H H H H H H H H H H H H H H H H H H H
charge: 0.195088 -0.234374 -0.270135 -0.273456 -0.271827 -0.393952 -0.378986 0.030910 0.046711 -0.678749 -0.657329 -0.486416 -0.491976 0.235479 0.307708 0.466718 0.474465 -0.522246 -0.512879 0.339244 0.348005 -0.403928 -0.387893 -0.391441 -0.375741 -0.364180 -0.360320 -0.190345 -0.205289 -0.537727 -0.536055 0.246439 0.293779 0.275450 0.241294 0.241689 0.238933 0.274469 0.204788 0.371951 0.287775 0.235282 0.247834 0.283043 0.278734 0.219311 0.207507 0.249069 0.247254 0.226897 0.231564 0.243101 0.219470 0.219571 0.247662 0.224346 0.223703
chargesum: 0.00000
title: Mulliken charges with hydrogens summed into heavy atoms:
elementType: S O O O O N N N N C C C C C C C C C C C C C C C C C C C C C C
charge: 0.195088 -0.234374 -0.270135 -0.273456 -0.271827 -0.022001 -0.091210 0.030910 0.046711 -0.138531 -0.140585 -0.005794 -0.012720 0.235479 0.307708 0.466718 0.474465 -0.286964 -0.265045 0.339244 0.348005 -0.120885 -0.109159 -0.172129 -0.168234 -0.115112 -0.113067 0.036552 0.026276 0.144414 0.159657
polarizability: 4.67114019e+02 1.12278971e+01 3.37541966e+02 -1.67209242e+01 1.30447697e-01 2.69643397e+02
1716.lowfreq: -12.6921 -7.0537 -3.9850 0.0003 0.0009 0.0011 3.3608 6.0470 14.7156
frequency: -11.0141 5.4434 14.6118 21.2109 23.8371 31.8270 42.1664 54.3476 58.0434 71.7978 83.9915 88.8081 97.3329 114.0328 120.3553 143.5939 154.4024 166.1896 178.6877 180.1075 199.7832 205.5312 230.9525 232.4916 241.9054 258.4380 263.3664 267.5391 269.2907 279.3337 294.5594 306.0844 318.9799 359.2258 373.2831 388.7698 408.3340 427.5877 435.8605 451.4689 452.7758 464.8787 473.2516 534.1674 547.0420 566.1851 588.8409 596.4165 601.5696 605.4979 624.6996 632.2767 646.5534 653.9134 678.1050 690.7573 695.8000 697.0778 752.8243 756.6748 798.0428 804.5959 813.1152 839.0156 856.1798 864.8667 879.8578 894.9160 898.2787 902.5682 908.1321 913.2512 939.6600 952.5689 952.9268 963.4333 977.6040 980.1448 981.4622 988.0874 989.9337 1003.7044 1010.1476 1015.0457 1016.5913 1053.6345 1079.5598 1086.1362 1091.8271 1111.3176 1112.3540 1120.5741 1135.0982 1153.0010 1155.1396 1162.3483 1165.7779 1176.6640 1183.9684 1191.0666 1193.5860 1230.1492 1246.0328 1262.7384 1266.6791 1279.3654 1295.1147 1303.8374 1304.8786 1319.7683 1332.4256 1337.2267 1350.4544 1395.5646 1397.6461 1415.9890 1426.9533 1428.6928 1437.0516 1441.3784 1443.0433 1449.6323 1451.7883 1465.6578 1468.2965 1469.8823 1473.2016 1479.2861 1485.7897 1506.3819 1550.3371 1571.5137 1575.8165 1595.0490 1600.3031 1604.5356 1618.6331 1625.0478 1647.3638 2954.4363 2960.7257 2962.5600 2975.4243 2990.8879 2997.9297 3013.9342 3021.4582 3039.8993 3051.7890 3069.6811 3083.0302 3095.0316 3097.8885 3120.5103 3128.8233 3136.6048 3139.4097 3140.9518 3144.3396 3165.1352 3167.4045 3174.8088 3178.0123 3251.7311 3367.5176
redmass: 6.6164 6.4273 4.6601 4.7017 5.7947 6.0276 4.6188 5.9430 4.9337 5.5813 4.9488 4.7635 3.2904 4.4879 5.8304 5.6600 5.8745 5.2050 4.6762 6.1223 1.8595 1.7223 3.6871 3.0088 2.4205 3.6701 2.6150 1.9127 2.2237 4.5999 2.2627 4.0583 4.0671 4.6032 3.8573 5.7880 4.3972 2.8916 3.9501 3.0235 2.9938 4.8813 5.3476 4.9318 4.7423 4.5410 4.7663 3.4269 4.4054 4.2400 4.3678 1.3856 6.2609 5.6762 2.9115 3.0667 1.9958 2.0590 5.9831 5.5666 1.4705 1.3700 1.2147 2.4664 1.7001 3.0033 1.5645 3.5424 1.3777 2.9411 2.2542 1.3769 2.4519 1.5841 1.5738 3.7156 3.8071 5.4635 4.1578 1.3355 1.3400 4.3272 4.2486 3.6609 3.5572 2.9911 1.8470 2.3173 1.6126 1.2614 1.2595 1.5256 1.4508 1.3826 1.3498 1.2466 1.3658 1.2740 1.5483 1.1296 1.3414 1.6933 2.0648 2.3550 2.3825 1.2753 1.2209 1.4431 1.5583 1.3406 1.5464 1.5955 1.6716 7.0605 7.6713 2.1654 1.2771 1.5318 1.0874 1.4864 1.3931 1.1190 1.1192 1.0503 1.0506 1.1940 1.0742 2.3560 2.0410 1.9149 2.3683 5.9342 3.1440 6.1589 6.3706 5.1796 6.2853 7.3207 4.4716 1.0332 1.0865 1.0334 1.0669 1.0872 1.0612 1.0589 1.0596 1.1037 1.1042 1.1000 1.1019 1.0983 1.1049 1.0989 1.0995 1.0875 1.0903 1.0876 1.0915 1.0924 1.0918 1.0984 1.0980 1.0818 1.0755
irintensity: 0.4574 0.0196 1.8797 0.0703 0.3261 1.4383 1.4050 2.2788 4.2550 1.4356 4.4759 2.2903 6.9025 11.6713 7.8825 1.5749 0.2076 7.8200 7.5276 4.7688 3.9150 0.9283 4.5304 17.7673 14.9829 3.1445 4.0692 0.4248 2.4892 5.8567 2.0113 2.5315 2.1863 0.7893 0.4755 7.5393 3.8033 4.2198 2.2999 2.7694 2.9938 11.1497 3.8804 2.5256 10.5307 2.1810 4.4145 2.3561 1.8233 1.5470 3.5646 64.2925 3.0291 5.3143 2.1335 4.8900 30.8438 27.2225 24.1057 20.9997 39.1698 64.3715 24.3324 34.4606 12.9374 6.2321 12.8996 3.8434 0.0894 26.8007 2.7622 0.8256 11.3976 39.4085 41.2623 1.8179 7.6467 5.9118 8.3321 1.8932 3.6942 70.1112 109.8772 18.0891 68.9151 4.1590 27.1509 11.2697 8.2424 0.2930 0.1744 273.9903 162.6510 1.9683 0.3608 26.7039 34.8555 70.8894 47.1778 0.5365 20.7311 139.8334 68.0162 252.4607 228.9155 41.2626 5.2881 14.9255 14.8642 11.3791 33.8606 21.0929 2.3849 6.1924 7.7433 30.3424 11.2084 21.0658 33.9108 0.3776 5.7613 7.6063 53.4032 12.6497 14.3058 92.6912 51.5549 101.7506 19.6154 239.3616 265.9390 143.5065 176.0754 3.3203 3.7834 42.2390 41.0751 368.8904 244.7982 56.2293 60.0317 63.3349 32.1789 41.5996 9.6548 48.2472 27.1782 50.4743 45.2074 13.2570 9.2989 14.1908 9.9523 34.0795 26.3276 19.1233 6.3416 8.4863 3.0789 3.2297 6.8354 12.7592 9.3054 440.0459 19.4407
temp: 298.150 k
press: 1.00000 atm
elementType: 16 8 8 8 8 7 7 7 7 6 6 6 6 6 6 6 6 6 6 6 6 6 6 6 6 6 6 6 6 6 6 1 1 1 1 1 1 1 1 1 1 1 1 1 1 1 1 1 1 1 1 1 1 1 1 1 1
symmnumber: 1
zpe: 1174867.4 jmol-1
zpe.correction: 0.447483 hartree
zpe.thermalcorrener: 0.478251 hartree
zpe.thermalcorrenthalpy: 0.479195 hartree
zpe.thermalcorrgfe: 0.380357 hartree
zpe.sumelectzpe: -1769.547240 hartree
zpe.sumelectthermal: -1769.516472 hartree
zpe.sumelectthermalent: -1769.515528 hartree
zpe.sumelectthermalfe: -1769.614366 hartree
dipole: 11.3783 -1.3350 6.5065
dipole: 13.1750
quadrupole: -172.0157 -174.4388 -184.5619
quadrupole: 1.3842 -15.5597 18.6697
quadrupole: 4.9897 2.5666 -7.5564 1.3842 -15.5597 18.6697
hfenergy: -1769.9947231 hartree
pointgroup: C01 [X(C22H26N4O4S1)]
dipole: 0.1793978 5.1426837 -0.6235862 debye
polarizability: 338.5450006|13.3856822|421.9421523|17.0549557|82.4102017|313.8122296 unknown
InChI: InChI=1S/C22H26N4O4S/c1-29-19-7-3-5-17(13-19)15-23-25-21(27)9-11-31-12-10-22(28)26-24-16-18-6-4-8-20(14-18)30-2/h3-8,13-16,25-26H,9-12H2,1-2H3
charge 0 multiplicity 1
57 atoms
S  4.493287 -1.451684 -0.011773
O  1.994727 -3.407748 2.534172
O  1.227096 0.037263 -0.871727
O  -3.873593 -5.178771 -3.941546
O  -1.294225 7.339425 3.351635
N  0.909461 -2.320802 0.742932
N  1.969062 2.205353 -0.402499
N  0.166911 -3.428902 0.372292
N  0.853072 2.528942 0.358559
C  4.03252 -1.188868 1.815522
C  4.59676 0.323115 -0.672558
C  2.522253 -1.06057 2.096619
C  3.457314 0.719482 -1.656193
C  1.787012 -2.384497 1.826307
C  2.111501 0.932584 -0.969343
C  -1.417529 -4.4147 -1.177607
C  -0.335418 4.203427 1.656182
C  -2.226699 -4.215823 -2.332583
C  -0.33679 5.535807 2.135424
C  -3.037551 -5.269358 -2.813708
C  -1.404467 6.004345 2.937942
C  -1.428866 -5.672846 -0.516133
C  -1.416115 3.331614 1.984156
C  -0.586071 -3.2995 -0.702722
C  0.792288 3.757295 0.829854
C  -3.048727 -6.523553 -2.154283
C  -2.47903 5.142015 3.267432
C  -2.24304 -6.712465 -1.010928
C  -2.468522 3.809553 2.7819
C  -3.905502 -3.904141 -4.658814
C  -2.370073 7.883256 4.185568
H  4.590278 -0.30545 2.173234
H  4.431929 -2.084365 2.321591
H  5.560743 0.378197 -1.205878
H  4.645825 1.005638 0.194917
H  2.079745 -0.215839 1.542206
H  2.397562 -0.853235 3.1778
H  3.326382 -0.078072 -2.405236
H  3.765354 1.640908 -2.192891
H  0.906112 -1.461152 0.158033
H  2.709805 2.905374 -0.568994
H  -2.208039 -3.241778 -2.833966
H  0.479521 6.227868 1.899398
H  -0.7990 -5.806496 0.368038
H  -1.404312 2.305008 1.607789
H  -0.625231 -2.359328 -1.288002
H  1.585548 4.50811 0.627948
H  -3.685381 -7.320767 -2.54974
H  -3.31186 5.4858 3.887622
H  -2.253626 -7.683836 -0.504183
H  -3.300319 3.144547 3.038516
H  -4.61608 -4.055956 -5.484827
H  -2.909213 -3.644452 -5.068328
H  -4.2620 -3.081768 -4.007446
H  -2.080238 8.925554 4.382325
H  -2.454899 7.332686 5.142474
H  -3.341348 7.859661 3.654424
