program: Gaussian 09
title: 000243979
version: EM64L-G09RevD.01
frameworkgroup: C1[X(C14H10N2O2)]
method: RPBEPBE
basis: SDD
operation: Freq
keyword: #p
keyword: freq=noraman
keyword: PBEPBE/SDD
title: #p freq=noraman PBEPBE/SDD
converged: YES YES NO YES
title: Mulliken charges:
elementType: O O N N C C C C C C C C C C C C C C H H H H H H H H H H
charge: -0.217070 -0.218011 -0.209131 0.022316 0.319155 0.441964 -0.377808 -0.542202 0.355335 -0.196597 -0.372735 -0.350860 -0.329138 -0.220062 -0.205436 -0.392679 -0.390918 0.386341 0.251926 0.254604 0.243735 0.246484 0.236229 0.227409 0.229933 0.239451 0.283930 0.283836
chargesum: 0.00000
title: Mulliken charges with hydrogens summed into heavy atoms:
elementType: O O N N C C C C C C C C C C C C C C
charge: -0.217070 -0.218011 -0.209131 0.022316 0.319155 0.441964 -0.125881 -0.287598 0.355335 0.047138 -0.126251 -0.114631 -0.101730 0.009871 0.034015 -0.108749 -0.107083 0.386341
polarizability: 4.12794339e+02 -3.34423411e-01 1.70301100e+02 -2.99581034e-02 -9.14189129e-02 6.58265907e+01
1716.lowfreq: -4.8974 -3.1119 -2.1217 -0.0011 -0.0007 0.0003 19.5053 41.1861 70.3465
frequency: 19.4563 41.1843 70.3448 79.1352 115.8056 212.2583 222.2441 226.4002 231.7401 325.6173 341.9829 409.1402 428.1959 447.1568 488.8087 504.6137 523.9078 557.2992 591.1079 603.3731 628.4805 642.9781 665.6576 683.3479 695.8439 726.1262 745.6897 756.0063 771.2506 793.2284 802.8909 834.6650 842.4957 866.6094 904.1724 911.3222 929.2717 966.3821 989.4474 993.8916 1002.4332 1010.3515 1050.6458 1097.6490 1112.3484 1121.5913 1154.8364 1185.1555 1192.7292 1220.7385 1232.2468 1258.4258 1293.1637 1301.1410 1331.4692 1357.3085 1365.8225 1383.5125 1405.5960 1434.0808 1454.2030 1468.8727 1519.8261 1532.9891 1555.1410 1585.2209 1612.8214 1639.7901 3150.9015 3152.9499 3156.8333 3165.7146 3176.1011 3182.5633 3185.4613 3192.8916 3221.5656 3230.3265
redmass: 4.1991 7.4690 7.3504 6.4079 6.7225 7.5588 8.6531 3.5149 6.5520 5.0083 4.9567 2.8636 2.9468 8.1210 5.2196 3.6834 4.5700 3.1212 6.8495 6.5525 6.8120 1.9663 4.1926 8.1893 1.8579 2.0095 1.7513 2.9697 4.8788 6.7148 1.7006 1.5107 1.2659 1.8512 5.4077 6.2346 1.3399 1.2986 1.3470 1.3729 3.1509 2.4156 2.0333 3.1294 1.3497 1.6782 1.1554 1.5691 1.4408 2.5452 1.8916 2.0081 2.8618 1.5725 3.2247 3.0290 3.4090 2.5328 9.3837 3.8956 3.0036 2.9170 5.8836 4.9870 5.0866 7.7088 6.1628 6.4745 1.0892 1.0866 1.0890 1.0891 1.0967 1.0949 1.0962 1.1014 1.0965 1.0979
irintensity: 0.2218 0.4370 0.0351 0.7593 4.2848 2.7125 0.0248 0.2431 0.4529 0.2567 0.4716 0.1041 9.5687 6.0018 1.9680 16.6761 1.8669 0.4001 0.1264 0.3667 0.3643 9.2352 17.9710 3.1705 1.2578 0.1083 85.0985 0.3357 7.7083 19.4812 106.4093 9.3246 0.2766 50.5288 0.3229 8.4381 1.9734 0.4784 2.8546 0.2143 0.0083 0.4799 19.1085 34.4762 20.6126 5.0973 3.9265 207.0594 118.2935 543.4674 65.9680 6.4978 25.7951 10.7975 27.0001 68.3243 21.6943 21.2218 3.4412 31.0443 14.7500 6.1757 26.1128 4.9432 16.3738 3.6178 299.0751 1.4652 9.8403 0.7728 6.0379 2.7196 13.6867 0.5883 3.5757 14.1571 0.9400 1.5436
temp: 298.150 k
press: 1.00000 atm
elementType: 8 8 7 7 6 6 6 6 6 6 6 6 6 6 6 6 6 6 1 1 1 1 1 1 1 1 1 1
symmnumber: 1
zpe: 546005.2 jmol-1
zpe.correction: 0.207962 hartree
zpe.thermalcorrener: 0.221726 hartree
zpe.thermalcorrenthalpy: 0.222671 hartree
zpe.thermalcorrgfe: 0.165523 hartree
zpe.sumelectzpe: -798.127501 hartree
zpe.sumelectthermal: -798.113737 hartree
zpe.sumelectthermalent: -798.112793 hartree
zpe.sumelectthermalfe: -798.169940 hartree
dipole: 8.5313 -0.8023 -0.0732
dipole: 8.5692
quadrupole: -127.6242 -89.5254 -109.2181
quadrupole: -2.9121 -0.3032 0.8245
quadrupole: -18.8350 19.2638 -0.4289 -2.9121 -0.3032 0.8245
hfenergy: -798.3354632 hartree
pointgroup: C01 [X(C14H10N2O2)]
dipole: -3.3542615 0.3369636 -0.0413486 debye
polarizability: 412.7778637|-1.9072802|170.2925549|0.8077058|-1.5619151|65.851611 unknown
InChI: InChI=1S/C14H10N2O2/c17-16(18)13-6-4-11(5-7-13)12-9-14-3-1-2-8-15(14)10-12/h1-10H
charge 0 multiplicity 1
28 atoms
O  5.619538 -1.148619 -0.072586
O  5.61435 1.128968 0.085243
N  -2.926652 0.693577 -0.072541
N  5.006972 -0.011324 0.006292
C  -0.770522 -0.028829 0.005143
C  -2.961067 -0.740815 0.068535
C  -1.603819 1.112783 -0.106406
C  -1.62403 -1.179983 0.112776
C  0.70013 -0.019574 0.006402
C  -4.099787 1.443806 -0.155668
C  -4.236713 -1.379485 0.131319
C  1.438009 -1.237224 -0.081456
C  1.434397 1.201102 0.095456
C  -5.32747 0.807155 -0.096153
C  -5.405052 -0.624112 0.050656
C  2.841882 -1.2451 -0.080885
C  2.837618 1.214113 0.094151
C  3.531641 -0.014484 0.006226
H  -1.35471 2.164017 -0.230117
H  -1.317751 -2.217098 0.232234
H  -3.981936 2.524422 -0.264941
H  -4.269185 -2.467286 0.241509
H  0.90299 -2.187989 -0.163993
H  0.898407 2.151645 0.181095
H  -6.237129 1.409567 -0.161859
H  -6.383934 -1.109825 0.097425
H  3.412853 -2.17456 -0.150226
H  3.40577 2.145253 0.164367
