program: Gaussian 09
title: 000020884
version: EM64L-G09RevD.01
frameworkgroup: C1[X(C4H5ClO3)]
method: RPBEPBE
basis: SDD
operation: Freq
keyword: #p
keyword: freq=noraman
keyword: PBEPBE/SDD
title: #p freq=noraman PBEPBE/SDD
converged: YES YES NO NO
title: Mulliken charges:
elementType: Cl O O O C C C C H H H H H
charge: -0.035680 -0.232098 -0.192681 -0.061732 -0.225220 -0.663858 0.326914 -0.096016 0.242315 0.242075 0.219650 0.238280 0.238051
chargesum: 0.00000
title: Mulliken charges with hydrogens summed into heavy atoms:
elementType: Cl O O O C C C C
charge: -0.035680 -0.232098 -0.192681 -0.061732 0.259171 0.032123 0.326914 -0.096016
polarizability: 7.67124418e+01 -4.47597398e+00 5.77829305e+01 -1.00305405e+00 4.32300532e+00 5.52814427e+01
1716.lowfreq: -20.3249 -7.7822 -0.0016 -0.0010 0.0028 3.3372 5.0715 42.6079 100.6815
frequency: -20.2617 42.5672 100.6797 118.6926 205.7566 251.5774 259.1919 344.9056 355.1770 439.4675 623.8261 662.1564 754.6970 796.4257 799.3050 912.3914 1009.4266 1113.4736 1130.8295 1176.3859 1249.6820 1353.5767 1404.1611 1462.9216 1470.6454 1483.8223 1631.4428 1733.5629 3001.3065 3020.5335 3083.7453 3097.9546 3116.9155
redmass: 11.9064 2.7668 3.0666 5.2828 2.6971 6.6934 1.6391 8.7341 3.7089 15.6006 8.9904 11.2447 10.2205 3.7326 1.1589 10.8551 2.1438 2.3117 1.4398 7.6667 1.1443 1.3581 1.2512 1.0389 1.0742 1.0611 11.9166 13.2798 1.0362 1.0581 1.1072 1.0983 1.1036
irintensity: 0.4661 0.5659 0.3266 0.1544 2.8158 18.6265 1.1377 3.9800 3.7975 47.7095 24.9569 68.7350 47.8110 4.6307 6.7271 168.0902 71.3381 9.3145 7.7257 310.1385 0.1678 4.2063 25.0313 13.8751 4.9902 15.7841 230.2999 251.3772 12.8944 12.3659 3.5287 20.7449 34.3942
temp: 298.150 k
press: 1.00000 atm
elementType: 17 8 8 8 6 6 6 6 1 1 1 1 1
symmnumber: 1
zpe: 228529.8 jmol-1
zpe.correction: 0.087042 hartree
zpe.thermalcorrener: 0.095393 hartree
zpe.thermalcorrenthalpy: 0.096337 hartree
zpe.thermalcorrgfe: 0.052443 hartree
zpe.sumelectzpe: -840.521235 hartree
zpe.sumelectthermal: -840.512884 hartree
zpe.sumelectthermalent: -840.511940 hartree
zpe.sumelectthermalfe: -840.555834 hartree
dipole: -4.2334 -1.0419 -0.1994
dipole: 4.3643
quadrupole: -46.5771 -55.8087 -57.0524
quadrupole: 0.0720 -0.9623 1.7854
quadrupole: 6.5690 -2.6626 -3.9063 0.0720 -0.9623 1.7854
hfenergy: -840.608277 hartree
pointgroup: C01 [X(C4H5Cl1O3)]
dipole: -1.7045296 0.1687505 0.1195462 debye
dipolederiv: -0.4146385 -0.193022 -0.2909699 -0.1985915 -0.2087365 -0.2469084 -0.3824288 -0.2740453 -0.7857394 -1.6206597 0.2793326 -0.0851346 0.379065 -0.5873048 0.0518629 0.0025332 0.0496713 -0.2456633 -0.639149 -0.0975071 -0.0064126 0.2700082 -0.8865059 0.0235405 -0.042173 0.133025 -0.2601494 -0.4372717 -0.0935362 0.3143003 -0.0942362 -0.2054933 0.0515784 0.0020417 -0.1045358 -1.057725 0.9907026 -0.0670866 0.0043082 0.0821497 0.2432962 0.0310205 -0.057029 0.0276407 0.3403081 -0.1262619 0.0755534 -0.0139253 0.058552 -0.0158011 0.0033594 -0.0008679 0.0085848 0.0517195 1.5182367 -0.1891509 0.094331 -0.7072018 1.2994886 -0.1125965 0.0709883 -0.223302 0.0981281 0.7012537 0.314649 -0.0025441 0.3028046 0.2595453 0.2272331 0.3950489 0.4164244 1.9108682 -0.037947 0.0356723 0.018149 -0.0503855 -0.0306003 -0.083367 0.0071028 -0.1014306 -0.0008803 -0.0466352 0.0347091 -0.0470839 -0.0361145 0.0447854 0.0625057 0.0095268 0.0742394 -0.0745063 -0.1185013 -0.0582169 0.0259784 -0.0638617 0.0552675 0.022619 0.0313302 0.0193746 0.1159174 0.1112737 -0.0368886 -0.0436331 0.0190688 -0.0259941 -0.0966803 -0.0327989 -0.1102068 0.0000695 0.1195978 -0.0045082 0.0326365 0.038743 0.0580533 0.0658327 -0.0032742 0.0845603 -0.0923471 unknown
polarizability: 75.2803758|4.3235906|53.3319681|4.9142141|3.2364457|61.1644711 unknown
InChI: InChI=1S/C4H5ClO3/c1-2-8-4(7)3(5)6/h2H2,1H3
charge 0 multiplicity 1
13 atoms
Cl 2.28137 0.84109 1.349892
O  -0.818586 0.311402 -0.112226
O  0.227255 -1.755202 0.262924
O  2.100504 0.404577 -1.352187
C  -2.183136 -0.298027 0.119646
C  -3.194117 0.825857 -0.057028
C  0.253508 -0.537148 -0.001123
C  1.545022 0.233708 -0.276854
H  -2.311079 -1.114573 -0.612525
H  -2.185822 -0.726879 1.137268
H  -4.213463 0.430592 0.104164
H  -3.017771 1.636197 0.669926
H  -3.143286 1.249206 -1.074076
