program: Gaussian 09
title: 000243983
version: EM64L-G09RevD.01
frameworkgroup: C1[X(C16H12BrN3O2)]
method: RPBEPBE
basis: SDD
operation: Freq
keyword: #p
keyword: freq=noraman
keyword: PBEPBE/SDD
title: #p freq=noraman PBEPBE/SDD
converged: YES YES NO NO
title: Mulliken charges:
elementType: Br O O N N N C C C C C C C C C C C C C C C C H H H H H H H H H H H H
charge: 0.018475 -0.207860 -0.206064 -0.467935 -0.062642 0.028746 -0.649523 0.149307 0.510923 0.331980 0.354283 -0.456401 -0.427083 -0.348916 -0.353327 -0.348553 -0.377047 -0.386443 0.366262 -0.189849 -0.195474 -0.223659 0.270293 0.235937 0.320648 0.259498 0.249400 0.263619 0.288326 0.288773 0.243025 0.215701 0.252745 0.252836
chargesum: 0.00000
title: Mulliken charges with hydrogens summed into heavy atoms:
elementType: Br O O N N N C C C C C C C C C C C C C C C C
charge: 0.018475 -0.207860 -0.206064 -0.147287 -0.062642 0.028746 -0.143293 0.149307 0.510923 0.331980 0.354283 -0.196903 -0.177683 -0.085297 -0.065002 -0.059781 -0.134022 -0.170742 0.366262 0.062896 0.057362 -0.223659
polarizability: 3.26487743e+02 -3.89568320e+00 2.32120147e+02 -1.76460717e+01 -1.12934535e+01 1.49256885e+02
1716.lowfreq: -4.3559 -3.0559 0.0004 0.0006 0.0006 0.7064 10.0807 18.4447 20.4502
frequency: 10.0415 18.2607 20.4356 43.8166 52.1808 67.7665 68.4900 108.2400 141.3607 187.0263 208.7213 219.0815 256.6921 275.8236 296.0534 325.8413 357.6539 403.5096 404.0191 409.8676 427.6269 454.6844 482.6845 505.8349 510.7553 617.2415 623.5644 625.4066 655.5220 667.0791 672.6148 674.3624 698.1885 713.9223 716.6358 762.3488 775.6945 818.6167 819.2168 832.3276 839.2960 854.4176 861.2585 924.1495 940.4425 950.3172 968.9186 981.9858 988.9064 994.8552 999.6099 1006.5160 1059.0140 1071.9819 1092.3304 1108.5657 1114.9073 1143.9345 1176.2890 1181.8034 1196.1060 1204.4224 1221.4845 1251.2468 1281.2390 1287.4690 1298.6837 1314.9887 1326.8726 1367.6636 1368.3098 1382.3820 1401.4697 1406.5654 1421.8595 1453.8039 1457.2656 1481.4722 1498.1404 1556.1123 1574.9122 1596.7882 1608.0611 1609.0642 2986.2803 3048.3920 3124.9784 3136.5196 3143.7467 3147.9883 3170.1068 3173.6150 3181.4938 3183.6799 3230.4813 3583.8869
redmass: 8.2700 5.1956 4.8255 5.4700 6.9748 8.0377 7.0297 7.2200 6.6074 7.0654 9.9319 7.5303 5.9230 6.0837 6.0983 3.0665 4.3010 5.8305 3.0368 2.9066 5.2474 4.4243 3.6569 7.0741 3.0738 6.3333 6.9520 6.8738 1.4637 4.9920 2.1034 6.1962 6.1961 4.1246 3.0989 5.8785 4.9697 1.6506 2.8246 1.3321 1.7770 1.3372 1.5668 2.5042 3.9199 1.3846 1.3781 5.2890 1.3630 4.4455 1.3639 3.0805 3.6347 1.9961 3.2691 1.3374 1.4195 1.8005 1.8204 1.3471 1.1312 2.4315 5.6090 1.5288 2.1387 1.4679 1.3481 1.5292 3.4196 7.3111 5.2741 4.4638 7.5392 3.4462 3.0200 1.1906 2.3614 2.3209 5.1489 5.3420 6.3867 7.6800 6.1454 6.0174 1.0632 1.0966 1.0894 1.0907 1.0909 1.0888 1.0952 1.0968 1.0942 1.0953 1.0982 1.0812
irintensity: 1.3383 0.1807 0.1831 3.5019 2.3427 2.6050 0.2546 0.9712 0.2648 3.0401 0.7180 0.2960 0.7154 7.7949 0.9323 1.8712 0.6965 4.2082 0.4022 0.2772 9.7436 14.1334 8.0080 0.3479 28.3412 1.0198 0.5927 0.9708 65.6524 15.9129 18.9249 10.6593 23.7150 4.6201 2.1650 21.5729 8.3489 45.4843 10.3338 56.6706 11.5887 8.2348 37.2113 2.4104 33.3190 0.2356 0.6333 3.2893 1.1825 31.4356 0.2366 6.6041 39.9527 5.6013 18.0219 18.9990 3.7506 36.4080 14.3146 69.8710 2.3936 2.1808 320.5960 58.3522 3.1575 8.1055 0.2651 5.6300 5.0132 70.9332 19.3329 3.4649 0.7151 7.0211 55.4053 17.5541 53.3100 6.9991 148.9792 9.7087 4.6050 1.7940 52.0612 15.0416 22.7294 4.1625 19.2708 10.0150 3.3840 5.7215 7.9858 0.8471 0.0381 3.8735 6.6737 21.0719
temp: 298.150 k
press: 1.00000 atm
elementType: 35 8 8 7 7 7 6 6 6 6 6 6 6 6 6 6 6 6 6 6 6 6 1 1 1 1 1 1 1 1 1 1 1 1
symmnumber: 1
zpe: 651164.8 jmol-1
zpe.correction: 0.248016 hartree
zpe.thermalcorrener: 0.266730 hartree
zpe.thermalcorrenthalpy: 0.267674 hartree
zpe.thermalcorrgfe: 0.195179 hartree
zpe.sumelectzpe: -943.465483 hartree
zpe.sumelectthermal: -943.446768 hartree
zpe.sumelectthermalent: -943.445824 hartree
zpe.sumelectthermalfe: -943.518319 hartree
dipole: 1.9059 2.6766 2.6427
dipole: 4.2166
quadrupole: -167.9209 -154.4993 -133.1316
quadrupole: -16.5809 -12.2943 -1.2615
quadrupole: -16.0703 -2.6487 18.7190 -16.5809 -12.2943 -1.2615
hfenergy: -943.7134982 hartree
pointgroup: C01 [X(C16H12Br1N3O2)]
dipole: 0.9389727 0.685759 1.1832963 debye
polarizability: 321.1742715|-9.4665887|233.8607449|-31.6167078|11.8463134|152.8297576 unknown
InChI: InChI=1S/C16H12BrN3O2/c17-13-5-3-12(4-6-13)15-10-18-16(19-15)9-11-1-7-14(8-2-11)20(21)22/h1-8,10,19H,9H2
charge 0 multiplicity 1
34 atoms
Br 6.785441 -2.712372 -0.901521
O  -5.762481 -2.603381 0.35731
O  -5.222842 -2.08295 -1.797437
N  0.837849 0.927209 0.719897
N  0.621345 3.088346 0.113291
N  -5.100171 -1.926686 -0.521437
C  -1.338689 2.091637 1.389423
C  0.015747 2.051824 0.737148
C  -2.311087 1.024402 0.889553
C  2.035238 1.257006 0.057702
C  3.13536 0.314095 -0.162604
C  1.866983 2.606036 -0.302469
C  -3.069135 0.251537 1.806493
C  -2.487658 0.806586 -0.503963
C  -3.987393 -0.717928 1.355379
C  -3.400278 -0.154433 -0.975629
C  4.428341 0.796338 -0.512083
C  2.957858 -1.093224 -0.041853
C  -4.138096 -0.907391 -0.03454
C  5.503175 -0.08591 -0.736543
C  4.027129 -1.988429 -0.254312
C  5.293415 -1.47521 -0.601353
H  -1.742189 3.099339 1.178522
H  -1.241973 2.017498 2.490396
H  0.618135 0.023835 1.137697
H  2.552828 3.243139 -0.856059
H  -2.943018 0.413146 2.88328
H  -1.905476 1.401256 -1.216833
H  -4.580283 -1.321342 2.047725
H  -3.553334 -0.331314 -2.0435
H  4.601381 1.874292 -0.594121
H  1.972307 -1.514713 0.189878
H  6.490173 0.303158 -1.002117
H  3.8713 -3.066796 -0.161025
