program: Gaussian 09
title: 000243948
version: EM64L-G09RevD.01
frameworkgroup: C1[X(C5H6N6)]
method: RPBEPBE
basis: SDD
operation: Freq
keyword: #p
keyword: freq=noraman
keyword: PBEPBE/SDD
title: #p freq=noraman PBEPBE/SDD
converged: YES YES NO NO
title: Mulliken charges:
elementType: N N N N N N C C C C C H H H H H H
charge: -0.458697 -0.074743 -0.027502 -0.061526 -0.603623 -0.595334 0.262839 -0.042171 0.121432 -0.351263 -0.027294 0.304339 0.234937 0.316966 0.351191 0.327056 0.323393
chargesum: 0.00000
title: Mulliken charges with hydrogens summed into heavy atoms:
elementType: N N N N N N C C C C C
charge: -0.154358 -0.074743 -0.027502 -0.061526 0.064533 0.055116 0.262839 -0.042171 0.121432 -0.116326 -0.027294
polarizability: 1.66019130e+02 -3.04620819e-02 9.16926094e+01 -1.44467013e-02 7.94231208e-03 3.94380574e+01
1716.lowfreq: -7.4391 -0.0011 -0.0009 -0.0005 1.8020 4.3447 113.1511 162.6130 215.7104
frequency: 113.1504 162.6126 215.7099 254.7399 290.7441 371.3663 382.0149 410.5202 437.4451 466.4385 471.0606 504.4226 519.5143 520.0597 599.5570 687.1326 688.0135 714.8319 787.3044 802.2672 818.9911 902.2248 909.7000 966.8704 1020.2873 1064.3890 1191.1976 1251.5954 1259.5825 1296.7205 1343.7240 1403.8568 1405.3133 1472.0551 1528.5554 1570.6880 1599.8181 1610.5771 1651.5280 3126.4164 3566.9179 3570.9839 3592.9216 3718.3820 3727.8078
redmass: 5.3958 5.7999 1.1628 3.4771 5.4271 2.9170 7.5097 1.5012 2.1483 6.5746 1.1491 1.2223 1.3394 2.1245 6.3705 7.4151 7.9304 11.1820 11.3272 6.6295 7.2776 1.4221 3.8333 2.8523 2.0440 2.6189 6.4715 1.4064 4.7343 2.3817 4.4323 4.8699 2.8076 3.5614 5.9966 2.2557 1.5365 2.5017 3.0805 1.0931 1.0438 1.0456 1.0809 1.1050 1.1060
irintensity: 17.5235 2.0763 66.9832 12.7090 8.9203 6.9363 0.8111 156.9367 182.6065 2.2813 298.9315 97.8439 4.4661 2.3454 1.7224 7.8383 3.7535 0.1782 12.9005 1.3616 4.4175 19.0840 3.8191 3.7787 0.4031 0.5491 28.8835 9.1641 100.0971 8.7450 52.6705 84.3085 259.2143 40.1376 425.4860 173.5174 355.5136 346.0115 270.7627 23.3034 138.4897 116.7087 29.2741 47.9536 46.1935
temp: 298.150 k
press: 1.00000 atm
elementType: 7 7 7 7 7 7 6 6 6 6 6 1 1 1 1 1 1
symmnumber: 1
zpe: 328793.7 jmol-1
zpe.correction: 0.125231 hartree
zpe.thermalcorrener: 0.134267 hartree
zpe.thermalcorrenthalpy: 0.135212 hartree
zpe.thermalcorrgfe: 0.091699 hartree
zpe.sumelectzpe: -521.874406 hartree
zpe.sumelectthermal: -521.865370 hartree
zpe.sumelectthermalent: -521.864425 hartree
zpe.sumelectthermalfe: -521.907938 hartree
dipole: -4.4721 3.3401 0.0186
dipole: 5.5818
quadrupole: -33.2728 -62.4825 -67.3441
quadrupole: -10.6963 0.0566 0.0116
quadrupole: 21.0937 -8.1161 -12.9776 -10.6963 0.0566 0.0116
hfenergy: -521.999637 hartree
pointgroup: C01 [X(C5H6N6)]
dipole: 1.7244313 -1.3597599 0.0069787 debye
dipolederiv: -0.7740113 -0.0021952 0.0005452 -0.1300969 -0.5961866 -0.0020152 0.003541 -0.0031369 -0.2915051 -1.4771861 0.0810994 0.0004476 0.2439112 -0.4144417 -0.0000285 -0.0000976 -0.000193 -0.3221965 -1.1669207 0.2843394 -0.0002199 -0.1309538 -0.3399435 -0.0003924 0.000367 -0.0002067 -0.2572121 -0.9927969 -0.1041429 -0.0001139 0.782711 -0.5673245 0.0005563 0.0005149 -0.000267 -0.2519796 -1.8383071 -0.2242295 0.0003615 -0.1709525 -0.2283931 -0.0010647 0.00039 -0.0010948 -0.7412 -1.4916254 0.496217 -0.0020636 0.6646613 -0.3539401 0.00121 -0.0068905 0.0026236 -0.7450659 0.1386056 -0.201609 -0.0009124 -0.7041478 -0.5109039 0.0003862 -0.0024045 0.0015542 0.082464 1.3913847 -0.1633932 0.0002047 0.5258924 0.4393862 -0.0002819 -0.0002449 -0.0004639 0.1009022 2.1865233 0.1697532 -0.0008193 -0.1107752 0.9022676 0.0016766 -0.0014885 0.0010332 0.213721 0.910595 0.2302171 0.0009766 -0.0997088 0.4040873 0.0000875 0.0011902 0.0002342 -0.0761083 1.9003788 -0.5812168 0.000924 -0.8963579 0.5481166 -0.0005151 0.0010213 -0.000204 0.1807295 0.1305074 -0.005434 -0.0001911 0.0038661 0.1371844 0.000388 -0.000892 0.0015962 0.373541 0.0864475 0.0307493 -0.0000434 0.0342361 -0.1211536 -0.000128 -0.0000391 -0.0001652 0.1328645 0.2571816 0.0032547 0.0000756 -0.0472348 0.1306402 0.0003984 -0.0008528 0.0003249 0.4113643 0.2518226 0.0439909 -0.0000525 0.1133073 0.2143971 0.0003056 0.0007169 0.0004257 0.3999505 0.207427 -0.042436 0.0002181 -0.0853896 0.2023024 -0.0007679 0.0021604 -0.0018324 0.3958856 0.2799739 -0.0149645 0.0006629 0.0070319 0.1539053 0.0001852 0.0030082 -0.0002282 0.393845 unknown
polarizability: 165.9665081|-1.9771997|91.7452311|0.0163124|0.0060605|39.4380575 unknown
InChI: InChI=1S/C5H6N6/c6-4-8-1-2-3(10-4)11-5(7)9-2/h1,9H,6-7H2
charge 0 multiplicity 1
17 atoms
N  1.688783 -1.110805 -0.000948
N  1.417408 1.17716 0.001231
N  -1.05233 1.1718 0.000355
N  -2.090263 -1.076814 -0.001213
N  3.662327 0.319388 -0.000836
N  -3.378389 0.881336 -0.001211
C  0.295446 -0.879674 0.000992
C  0.157283 0.55803 0.00044
C  2.298456 0.151621 -0.000387
C  -0.858875 -1.670882 -0.000639
C  -2.123867 0.307163 -0.00035
H  2.150068 -2.01811 0.002779
H  -0.845311 -2.7669 -0.001487
H  4.31637 -0.456559 0.000423
H  4.010516 1.274366 -0.002778
H  -3.455683 1.894157 0.003042
H  -4.197039 0.280624 0.002387
