program: Gaussian 09
title: 000243978
version: EM64L-G09RevD.01
frameworkgroup: C1[X(C11H22N2S)]
method: RPBEPBE
basis: SDD
operation: Freq
keyword: #p
keyword: freq=noraman
keyword: PBEPBE/SDD
title: #p freq=noraman PBEPBE/SDD
converged: NO YES NO NO
title: Mulliken charges:
elementType: S N N C C C C C C C C C C C H H H H H H H H H H H H H H H H H H H H H H
charge: 0.087487 -0.288956 -0.613096 0.027176 -0.033548 0.270940 -0.472546 -0.472022 -0.449050 -0.417956 -0.330945 -0.731711 -0.747722 -0.790925 0.176450 0.220428 0.189403 0.205881 0.219051 0.215913 0.225467 0.218894 0.186178 0.293183 0.235014 0.233097 0.228138 0.202062 0.212090 0.223083 0.214813 0.219509 0.239064 0.226498 0.286613 0.292044
chargesum: 0.00000
title: Mulliken charges with hydrogens summed into heavy atoms:
elementType: S N N C C C C C C C C C C C
charge: 0.087487 0.004227 -0.034438 0.203627 -0.033548 0.270940 -0.062715 -0.047091 -0.007669 -0.012883 -0.095931 -0.068414 -0.097736 -0.105854
polarizability: 1.71809622e+02 6.15828522e+00 1.48884434e+02 1.01315598e+00 -1.04770059e+00 1.21998149e+02
1716.lowfreq: -23.1576 -12.8141 -0.0010 0.0012 0.0023 11.7828 65.8207 143.5598 150.0850
frequency: 65.2006 143.5369 150.0568 183.7709 197.6975 231.1046 240.4912 250.7919 254.1641 261.6543 279.6404 286.5049 305.9272 322.6742 327.6130 350.2601 365.5335 387.2780 400.0357 434.4077 456.4936 472.4178 487.7258 507.5295 541.9674 559.9903 571.9761 604.7367 647.9176 697.9503 755.9456 823.7873 846.7357 876.1033 912.6809 918.6903 925.0293 942.9672 950.6469 998.4056 1012.1165 1024.3774 1057.6126 1063.0058 1087.8340 1117.6393 1125.1664 1139.2297 1147.3526 1169.2526 1177.2836 1192.5297 1213.8728 1226.0398 1241.6391 1246.6094 1259.5421 1267.3996 1306.8575 1313.7367 1322.0597 1328.0534 1338.0107 1352.6232 1367.4467 1369.7989 1385.4019 1388.0640 1449.2526 1456.0995 1459.6828 1461.0381 1464.2834 1469.8748 1471.1246 1475.4257 1480.0822 1490.9058 1494.7611 1595.2707 2948.8507 2952.5666 2963.3062 2967.9768 2976.5679 2979.4544 2984.2169 2988.6580 2990.9800 3028.0555 3029.8570 3042.6787 3047.9320 3058.4462 3072.4077 3072.9522 3082.3777 3083.3088 3086.0519 3498.0104 3499.4856 3648.4733
redmass: 3.2069 4.4113 2.7754 2.9550 3.3354 1.2345 1.3537 1.9832 1.5359 1.4775 1.6881 1.8806 1.7523 2.4386 2.2060 2.8621 2.7049 2.7563 2.7109 2.6217 1.9367 3.1086 1.9994 2.6496 3.7144 2.6208 1.8015 2.8868 2.1329 2.3391 2.4037 2.1187 2.1709 2.2448 2.0532 2.0112 1.6453 1.6734 1.8298 1.4181 1.5819 1.6314 2.2524 2.2399 1.8194 2.4304 2.4853 1.8579 1.6017 1.4987 2.2103 2.4226 2.2233 1.3540 1.4978 1.5842 2.0009 1.7397 1.3782 1.2772 1.3612 1.4479 1.3651 1.4403 1.2947 1.2115 1.2005 1.2092 1.0819 1.1196 1.0874 1.0559 1.0570 1.0710 1.1669 1.0607 1.0766 1.0882 1.0737 1.1126 1.0675 1.0761 1.0421 1.0641 1.0354 1.0370 1.0639 1.0818 1.0684 1.0919 1.0944 1.1013 1.0971 1.0963 1.0996 1.0989 1.0992 1.0996 1.0993 1.0715 1.0475 1.1012
irintensity: 0.3191 3.6362 1.9211 1.8118 4.2127 2.5777 1.4489 3.3213 0.9265 4.5751 3.1412 3.1287 6.7326 7.1783 5.9887 1.2592 5.3079 16.6035 13.0473 6.6424 81.9104 49.1469 52.4102 22.0899 7.4197 31.9216 135.5712 163.2062 33.9767 14.3235 1.6879 9.7401 1.0241 2.0829 2.3321 3.1569 1.3201 0.5964 2.1252 0.4637 7.0577 2.7515 4.1111 11.5267 6.7654 3.5753 17.6319 6.9481 8.6509 9.8097 8.6579 35.3191 62.8086 107.5671 3.1329 7.6754 48.9936 17.0340 2.0467 22.7033 3.8544 0.5601 3.4854 2.9326 4.5404 25.7273 11.0278 42.6631 3.3847 33.1234 9.6670 11.3496 7.1941 5.1518 56.4304 9.5281 0.3035 15.8601 5.8280 88.8543 19.5970 19.8951 38.3853 53.4990 18.4630 22.4351 94.7508 48.3739 42.9950 22.1130 29.8656 25.4784 38.2369 48.1255 24.6327 27.0073 35.9165 26.3350 46.8970 7.1880 2.9997 5.1656
temp: 298.150 k
press: 1.00000 atm
elementType: 16 7 7 6 6 6 6 6 6 6 6 6 6 6 1 1 1 1 1 1 1 1 1 1 1 1 1 1 1 1 1 1 1 1 1 1
symmnumber: 1
zpe: 837081.0 jmol-1
zpe.correction: 0.318827 hartree
zpe.thermalcorrener: 0.334073 hartree
zpe.thermalcorrenthalpy: 0.335018 hartree
zpe.thermalcorrgfe: 0.279404 hartree
zpe.sumelectzpe: -938.773767 hartree
zpe.sumelectthermal: -938.758521 hartree
zpe.sumelectthermalent: -938.757577 hartree
zpe.sumelectthermalfe: -938.813190 hartree
dipole: 1.8060 -1.5366 1.3590
dipole: 2.7330
quadrupole: -94.0819 -92.2272 -95.0632
quadrupole: 4.0295 -1.8158 4.1984
quadrupole: -0.2911 1.5636 -1.2724 4.0295 -1.8158 4.1984
hfenergy: -939.0925943 hartree
pointgroup: C01 [X(C11H22N2S1)]
dipole: -0.6272102 0.6093644 0.6256396 debye
polarizability: 172.7042876|4.0022809|147.3494838|-2.1584385|3.7805767|122.6384322 unknown
InChI: InChI=1S/C11H22N2S/c1-10(2)8-4-6-11(3,7-5-8)14-9(12)13-10/h8-9,13H,4-7,12H2,1-3H3
charge 0 multiplicity 1
36 atoms
S  1.315982 -1.602359 -0.702995
N  -1.530563 -0.906643 -0.418404
N  -0.845982 -3.133696 -0.177807
C  -0.594092 1.473014 0.102888
C  2.058036 0.049839 -0.003655
C  -1.823971 0.461509 0.086279
C  0.340619 1.463296 1.351117
C  0.242387 1.414483 -1.222946
C  1.480131 0.40591 1.396726
C  1.756923 1.195997 -0.998823
C  -0.514702 -1.750232 0.107436
C  3.575475 -0.22167 0.083228
C  -2.476548 0.352966 1.490881
C  -2.883255 1.035437 -0.896252
H  -1.09217 2.464556 0.146623
H  -0.255557 1.409781 2.280693
H  0.822211 2.461719 1.36964
H  0.095087 2.338519 -1.813506
H  -0.115424 0.574932 -1.848036
H  2.307566 0.827175 2.00404
H  1.170499 -0.513726 1.924913
H  2.240672 0.975259 -1.969622
H  2.227507 2.12365 -0.606719
H  -1.710342 -1.065428 -1.41462
H  -0.340072 -1.497625 1.170396
H  3.796321 -0.989413 0.845673
H  3.977282 -0.576206 -0.883506
H  4.110255 0.709941 0.35756
H  -2.670274 1.355367 1.916337
H  -3.436856 -0.186603 1.41169
H  -1.838773 -0.199549 2.203465
H  -3.27456 1.997922 -0.522889
H  -2.450018 1.209951 -1.898987
H  -3.731247 0.333984 -0.998821
H  -1.808501 -3.399289 0.03566
H  -0.124051 -3.829669 0.010146
