program: Gaussian 09
title: 000243944
version: EM64L-G09RevD.01
frameworkgroup: C1[X(C14H13N5O2)]
method: RPBEPBE
basis: SDD
operation: Freq
keyword: #p
keyword: freq=noraman
keyword: PBEPBE/SDD
title: #p freq=noraman PBEPBE/SDD
converged: YES YES NO NO
title: Mulliken charges:
elementType: O O N N N N N C C C C C C C C C C C C C C H H H H H H H H H H H H H
charge: -0.405889 -0.226041 -0.394920 -0.134220 -0.383363 -0.032168 -0.000120 -0.164689 -0.568563 0.536759 0.301483 0.021919 0.144015 -0.443726 -0.363591 0.099197 -0.407989 -0.223446 -0.247474 -0.245865 -0.355720 0.309115 0.211915 0.254135 0.319581 0.229317 0.246324 0.262333 0.226423 0.229576 0.344213 0.229818 0.244320 0.387343
chargesum: 0.00000
title: Mulliken charges with hydrogens summed into heavy atoms:
elementType: O O N N N N N C C C C C C C C C C C C C C
charge: -0.018546 -0.226041 -0.075339 -0.134220 -0.039150 -0.032168 -0.000120 0.144425 -0.102514 0.536759 0.301483 0.021919 0.144015 -0.214409 -0.117267 0.099197 -0.145656 0.002976 -0.017898 -0.016047 -0.111399
polarizability: 1.93013477e+02 -1.95933605e+01 1.82752742e+02 2.14391529e+00 -8.75009645e+00 1.80152814e+02
1716.lowfreq: -7.5297 -5.3646 -0.0004 0.0003 0.0005 6.2818 7.5549 24.9798 34.4613
frequency: 3.9257 24.9052 34.3766 44.5666 57.3262 81.8849 109.6365 129.1725 151.5187 202.7131 228.2807 245.9462 272.1719 291.9270 329.1499 401.8529 402.5994 424.4149 469.6910 512.8229 521.4098 525.9895 546.9970 562.3367 595.0869 616.1047 617.5778 618.4262 646.7886 657.8298 669.5734 694.6326 700.8299 737.3286 744.2118 790.7096 809.0873 834.0418 850.4567 854.3227 875.4312 910.3365 924.9551 927.3763 934.7026 974.7156 990.6732 995.0712 1006.1117 1026.6064 1031.6296 1037.9272 1066.9420 1090.1817 1139.1687 1156.2301 1173.4184 1193.8815 1210.1416 1214.9822 1230.8233 1246.3359 1272.0394 1299.7551 1308.2505 1318.1839 1330.6491 1342.5742 1351.5830 1358.2654 1383.7723 1390.1832 1410.2804 1440.8330 1444.9303 1468.0503 1487.9836 1498.7730 1553.2561 1594.1216 1599.8726 1615.8293 1658.1934 2982.1437 3033.2293 3054.2473 3113.9640 3126.1440 3137.5474 3148.0578 3162.5991 3164.1283 3217.2444 3510.9598 3559.5319 3619.7697
redmass: 4.4707 6.0182 5.5880 10.3271 5.9369 5.9189 4.7882 5.8456 5.4342 5.1925 6.1977 6.6360 5.3851 3.7696 2.6806 3.2769 2.8172 5.8630 3.0595 2.0442 4.4704 3.9606 3.4509 4.3847 1.4367 2.2545 5.5629 4.1170 7.2453 1.6429 9.0551 4.1282 1.9947 4.6657 1.7503 3.1111 4.6179 1.8116 1.2528 3.6426 2.6501 3.8112 1.7769 3.5455 1.4431 1.4217 4.4639 1.4736 2.7896 3.1500 2.6141 4.2524 2.7256 1.7199 2.1958 4.9153 1.0579 1.1558 1.7842 1.7764 1.6984 1.4665 2.7470 1.4355 1.3964 2.8142 2.0882 3.0080 1.3610 3.1936 6.1058 3.4993 1.8898 2.0502 2.2931 1.1649 2.2451 2.7051 6.3529 5.9244 5.4614 5.9569 8.7922 1.0593 1.0983 1.0872 1.0874 1.0860 1.0914 1.0959 1.0922 1.1015 1.0977 1.0642 1.0769 1.0825
irintensity: 0.0706 0.2218 1.1300 1.0565 0.5833 0.7927 0.9835 0.2881 0.8340 2.9423 1.4461 3.9063 1.7339 1.8966 5.5140 9.2039 1.1452 18.0738 9.9917 42.7086 62.7274 13.7488 2.4250 2.9302 171.9622 29.2268 8.6186 35.0234 10.9630 70.8658 26.2794 25.0006 48.7593 9.4702 44.2134 35.7876 3.4596 13.0218 1.2450 22.9891 18.7833 42.8778 2.2248 5.4450 11.2292 0.2133 0.1866 2.1873 56.4245 87.1776 14.9165 54.1662 128.3308 10.0586 6.5988 35.8909 0.0582 5.8899 7.4419 8.8079 14.7313 2.9778 34.7536 17.3933 11.8744 79.0224 31.4758 47.7674 11.6006 19.6662 0.2846 19.2314 10.3302 9.4687 61.1986 28.6640 13.5082 11.3299 208.7131 2.2294 516.4309 14.4401 216.7588 24.8143 10.8288 21.2787 8.1399 0.1045 16.5176 32.0319 16.5350 19.9849 1.6886 29.3541 53.6404 103.3107
temp: 298.150 k
press: 1.00000 atm
elementType: 8 8 7 7 7 7 7 6 6 6 6 6 6 6 6 6 6 6 6 6 6 1 1 1 1 1 1 1 1 1 1 1 1 1
symmnumber: 1
zpe: 677847.3 jmol-1
zpe.correction: 0.258178 hartree
zpe.thermalcorrener: 0.275796 hartree
zpe.thermalcorrenthalpy: 0.276740 hartree
zpe.thermalcorrgfe: 0.208023 hartree
zpe.sumelectzpe: -964.013270 hartree
zpe.sumelectthermal: -963.995653 hartree
zpe.sumelectthermalent: -963.994708 hartree
zpe.sumelectthermalfe: -964.063425 hartree
dipole: -2.8317 0.7104 -0.5564
dipole: 2.9720
quadrupole: -121.8665 -112.3548 -122.0175
quadrupole: -6.5711 5.0124 2.5455
quadrupole: -3.1202 6.3915 -3.2713 -6.5711 5.0124 2.5455
hfenergy: -964.2714486 hartree
pointgroup: C01 [X(C14H13N5O2)]
dipole: -1.004832 0.3982558 -0.446003 debye
polarizability: 183.4438972|-17.8803345|183.8428316|7.277766|-11.4145361|188.6323038 unknown
InChI: InChI=1S/C14H13N5O2/c20-14(21)11(6-9-4-2-1-3-5-9)18-12-10-7-17-19-13(10)16-8-15-12/h1-5,7-8,11,18-20H,6H2
charge 0 multiplicity 1
34 atoms
O  -1.313142 4.092619 -0.733054
O  0.227918 3.197896 -2.226669
N  0.237946 0.783231 -0.815445
N  0.82995 0.587999 1.464776
N  3.899828 -1.897362 0.419601
N  2.710372 -0.7728 2.266632
N  3.822645 -1.994033 -0.973382
C  -0.829595 1.738335 -0.522671
C  -2.248566 1.229248 -0.943695
C  -2.653336 -0.104429 -0.326195
C  1.064384 0.260743 0.152967
C  2.154287 -0.614595 -0.167835
C  -0.545947 3.051318 -1.255787
C  -3.289256 -1.083186 -1.131262
C  -2.463604 -0.379375 1.052684
C  2.920548 -1.081736 0.949672
C  2.762129 -1.213991 -1.322348
C  -3.735407 -2.303957 -0.575848
C  -2.906638 -1.598779 1.610177
C  -3.546899 -2.565368 0.800194
C  1.650231 0.063576 2.429928
H  -0.802264 1.922294 0.564669
H  -2.289053 1.15124 -2.047895
H  -2.969096 2.018923 -0.653803
H  0.483642 0.637766 -1.796079
H  -3.438528 -0.88802 -2.200878
H  -1.949046 0.345478 1.693346
H  2.501047 -1.131971 -2.376291
H  -4.225123 -3.047493 -1.214809
H  -2.747336 -1.796183 2.676193
H  4.628473 -2.403908 0.917847
H  -3.888861 -3.511292 1.234732
H  1.419867 0.358857 3.458018
H  -1.141169 4.929654 -1.244291
