program: Gaussian 09
title: 000243953
version: EM64L-G09RevD.01
frameworkgroup: C1[X(C17H18FN5O4S)]
method: RPBEPBE
basis: SDD
operation: Freq
keyword: #p
keyword: freq=noraman
keyword: PBEPBE/SDD
title: #p freq=noraman PBEPBE/SDD
converged: YES YES NO NO
title: Mulliken charges:
elementType: S F O O O O N N N N N C C C C C C C C C C C C C C C C C H H H H H H H H H H H H H H H H H H
charge: 0.287539 -0.204981 -0.285244 -0.446523 -0.462980 -0.436731 -0.183061 -0.045477 -0.107116 -0.051490 -0.588746 -0.140068 -0.052473 -0.248545 -0.037920 -0.339693 0.205315 -0.212872 0.081312 -0.345270 -0.042693 -0.805787 0.478119 -0.337447 -0.344266 -0.359600 -0.359688 0.319650 0.248101 0.252530 0.281664 0.259459 0.209255 0.217932 0.368470 0.364399 0.273884 0.355844 0.287070 0.289287 0.333629 0.321141 0.245418 0.243768 0.257606 0.257281
chargesum: 0.00000
title: Mulliken charges with hydrogens summed into heavy atoms:
elementType: S F O O O O N N N N N C C C C C C C C C C C C C C C C C
charge: 0.287539 -0.204981 -0.285244 -0.078053 -0.098582 -0.080887 -0.183061 -0.045477 -0.107116 -0.051490 0.066024 0.108032 0.200058 0.033119 0.221538 0.087494 0.205315 0.061012 0.081312 -0.345270 -0.042693 -0.229430 0.478119 -0.092029 -0.100498 -0.101994 -0.102407 0.319650
polarizability: 4.00639875e+02 1.81749309e+00 2.17894198e+02 -7.19388408e+00 -1.55912811e+01 1.83904839e+02
1716.lowfreq: -5.8383 -4.3473 -3.2314 0.0003 0.0010 0.0012 4.2903 15.9820 22.4166
frequency: 3.9512 15.3532 22.4127 26.3303 28.9673 42.2665 67.4970 71.4193 82.1188 97.6421 115.9950 124.4616 133.5841 166.5409 178.1032 196.3817 217.4177 250.4952 253.0265 290.6695 293.7774 301.5798 316.0347 326.9775 342.9684 361.9082 371.5601 395.7286 411.1695 413.0604 417.7216 433.4422 457.5704 469.4296 501.4248 505.9898 512.8482 514.7411 534.9450 561.7154 584.0406 591.0260 624.5351 629.0494 647.4359 654.2198 680.9172 714.5782 721.5553 725.7610 745.3548 779.2872 781.9097 805.4640 817.8349 818.4917 824.0934 826.4774 843.5361 875.9501 881.3708 887.8819 922.1784 945.1713 958.4125 958.5671 974.9892 991.0546 1006.2149 1012.1990 1019.0527 1037.4168 1042.2649 1062.9910 1089.5077 1103.6897 1108.6597 1127.1898 1156.3621 1162.3371 1177.5977 1184.5737 1197.9006 1200.3963 1208.9097 1219.4049 1243.1841 1263.4622 1267.4453 1288.9758 1290.4414 1295.6651 1301.0306 1309.8635 1311.6170 1331.1408 1339.4747 1350.8598 1372.1532 1378.6227 1384.7812 1388.8963 1391.0293 1407.3643 1439.1931 1444.1288 1461.7041 1493.0070 1495.9637 1519.1899 1563.4858 1601.6423 1607.6418 1612.7536 2966.2394 3013.9181 3022.9299 3051.8749 3054.3738 3057.0789 3073.5910 3126.4457 3139.5501 3141.7910 3175.7200 3178.3991 3229.9197 3412.0021 3548.8053 3568.1666 3590.0090 3725.3628
redmass: 7.9511 4.1547 6.5480 5.7580 9.5172 6.2599 5.9995 7.2362 7.6893 3.7758 6.5248 8.2603 8.2674 6.4291 3.7507 9.2511 8.1578 2.5733 6.1309 2.9806 4.9082 1.8440 4.9825 3.7282 6.7419 4.7234 3.3141 3.9886 2.9446 5.9262 8.4400 1.2168 1.2621 5.8968 1.1586 3.7149 3.7813 3.6736 3.9232 5.2145 1.2270 7.8481 5.6080 6.8037 4.6428 5.3484 4.7118 11.6549 4.3636 6.1956 4.1172 8.1406 5.2480 3.0267 1.2621 1.7421 6.0668 4.9811 1.8759 3.6762 8.8238 1.5310 4.0655 1.3785 1.3635 5.2796 4.4643 3.2832 2.7863 3.3566 2.5082 2.4946 2.7451 4.0738 1.2521 2.1449 5.1083 1.0846 1.4644 1.2180 2.0720 1.5701 1.7835 2.1953 1.2836 2.3444 1.6389 1.2712 1.4195 1.5043 2.1747 1.2771 1.3730 4.6693 1.3378 4.2999 1.2564 1.5189 2.4361 1.3072 7.3456 1.7982 1.7903 3.1193 4.4683 1.1152 1.0895 3.2584 2.7462 9.3464 9.5411 7.6011 1.4688 6.4553 1.0662 1.0870 1.0845 1.0581 1.0864 1.0874 1.0978 1.1081 1.0904 1.0900 1.0955 1.0964 1.0985 1.0646 1.0656 1.0443 1.0668 1.1057
irintensity: 0.1854 0.2258 0.1064 0.2339 0.2269 0.7993 4.0457 3.3839 4.8692 5.8697 0.3978 0.9332 1.7746 5.6801 1.2098 0.0714 1.1664 27.5537 3.1426 1.5613 18.0575 16.5995 9.7204 8.9704 1.3690 10.9621 8.9976 3.0787 0.0400 14.8591 3.5874 194.3938 180.8126 30.8990 16.1795 14.7703 10.1711 13.3536 36.3791 2.0771 126.4061 0.2950 22.4384 0.2860 18.8837 12.0303 26.1066 3.2910 7.1057 71.6136 7.1772 45.3203 20.5571 25.4401 0.5999 8.7546 10.2328 56.4947 71.0578 43.9077 136.1985 0.6003 113.8580 0.1817 0.0136 1.2926 117.4026 154.0644 11.1210 73.1649 32.2983 12.4374 40.9753 11.5870 8.0554 21.8110 90.9628 5.1696 61.7909 15.8261 49.0271 76.1040 37.7452 62.0309 4.8420 9.1967 38.7377 8.4470 2.5543 19.3420 16.2492 1.6344 22.5769 54.3896 27.0670 29.3892 56.9145 17.3339 205.9214 20.7458 0.0498 6.2939 40.3350 1.7008 45.0297 10.7446 1.5973 235.8140 87.0880 416.5370 187.4580 5.4657 388.5751 28.1781 39.7352 53.2252 21.5862 6.3221 11.4826 10.2594 35.2035 2.1898 8.3736 10.7058 4.0621 2.8158 0.2765 61.7614 9.2591 103.6847 20.6337 42.0421
temp: 298.150 k
press: 1.00000 atm
elementType: 16 9 8 8 8 8 7 7 7 7 7 6 6 6 6 6 6 6 6 6 6 6 6 6 6 6 6 6 1 1 1 1 1 1 1 1 1 1 1 1 1 1 1 1 1 1
symmnumber: 1
zpe: 899519.6 jmol-1
zpe.correction: 0.342609 hartree
zpe.thermalcorrener: 0.368722 hartree
zpe.thermalcorrenthalpy: 0.369667 hartree
zpe.thermalcorrgfe: 0.280959 hartree
zpe.sumelectzpe: -1729.102966 hartree
zpe.sumelectthermal: -1729.076853 hartree
zpe.sumelectthermalent: -1729.075908 hartree
zpe.sumelectthermalfe: -1729.164616 hartree
dipole: 1.7294 4.2325 -5.1438
dipole: 6.8821
quadrupole: -197.3746 -166.8199 -163.2465
quadrupole: -3.0623 -16.5302 -12.0303
quadrupole: -21.5610 8.9938 12.5672 -3.0623 -16.5302 -12.0303
hfenergy: -1729.4455751 hartree
pointgroup: C01 [X(C17H18F1N5O4S1)]
dipole: 0.5158698 -2.3541508 -1.2341065 debye
polarizability: 399.073965|-18.3175231|192.9792741|-4.5441149|21.586395|210.3856727 unknown
InChI: InChI=1S/C17H18FN5O4S/c18-9-3-1-8(2-4-9)6-28-15-11-14(21-17(19)22-15)23(7-20-11)16-13(26)12(25)10(5-24)27-16/h1-4,7,10,12-13,16,24-26H,5-6,19H2
charge 0 multiplicity 1
46 atoms
S  -2.444456 0.577841 1.004767
F  -9.026343 1.051532 0.583654
O  4.518901 1.250016 0.276601
O  5.810398 -1.092478 2.021061
O  6.20148 -1.852739 -0.494873
O  5.060492 2.21335 -2.360048
N  2.572747 0.522678 1.502334
N  0.541197 1.255886 2.302859
N  1.778499 -0.779276 -0.463039
N  -0.677682 -0.7171 -0.667794
N  0.642865 -1.878095 -2.205356
C  4.60204 -0.988021 1.211751
C  4.033689 0.439088 1.406885
C  4.972424 -1.06158 -0.304008
C  5.27094 0.39949 -0.694298
C  4.799919 0.798558 -2.095445
C  1.603103 0.001041 0.637448
C  1.867278 1.274822 2.472882
C  0.351747 0.462682 1.153954
C  -0.805828 0.057639 0.439446
C  0.587881 -1.09745 -1.071554
C  -3.528909 -0.235703 -0.357334
C  -4.975524 0.106334 -0.104049
C  -5.543173 1.290613 -0.643881
C  -5.79471 -0.749681 0.677905
C  -6.897904 1.617404 -0.420033
C  -7.152339 -0.443618 0.914774
C  -7.67112 0.737273 0.356647
H  3.873415 -1.765008 1.509463
H  4.44176 0.857861 2.343174
H  4.1184 -1.465684 -0.874197
H  6.350364 0.611189 -0.573343
H  3.719631 0.560976 -2.196177
H  5.37564 0.244118 -2.856681
H  6.504662 -1.51236 1.436273
H  5.971644 -2.786636 -0.726056
H  2.39055 1.80297 3.267763
H  4.641516 2.732916 -1.625874
H  -3.326159 -1.315913 -0.309993
H  -3.154428 0.151948 -1.316495
H  -0.223875 -2.1134 -2.680097
H  1.542197 -2.167874 -2.577004
H  -4.919322 1.964423 -1.241731
H  -5.367235 -1.662868 1.106921
H  -7.347766 2.525383 -0.831465
H  -7.794704 -1.095746 1.513266
