program: Gaussian 09
title: 000243952
version: EM64L-G09RevD.01
frameworkgroup: C1[X(C17H18FN5O4S)]
method: RPBEPBE
basis: SDD
operation: Freq
keyword: #p
keyword: freq=noraman
keyword: PBEPBE/SDD
title: #p freq=noraman PBEPBE/SDD
converged: YES YES NO NO
title: Mulliken charges:
elementType: S F O O O O N N N N N C C C C C C C C C C C C C C C C C H H H H H H H H H H H H H H H H H H
charge: 0.290712 -0.199349 -0.284904 -0.446625 -0.463623 -0.437078 -0.182881 -0.045883 -0.108163 -0.050701 -0.588738 -0.140460 -0.053371 -0.248261 -0.037735 -0.340366 0.205459 -0.213279 0.080043 -0.340086 -0.042171 -0.782268 0.314682 0.171465 -0.320700 -0.359239 -0.235977 -0.197920 0.248994 0.252250 0.281858 0.259324 0.210212 0.217442 0.368217 0.364433 0.273399 0.355636 0.308964 0.287760 0.320591 0.334369 0.247545 0.256702 0.233136 0.236584
chargesum: 0.00000
title: Mulliken charges with hydrogens summed into heavy atoms:
elementType: S F O O O O N N N N N C C C C C C C C C C C C C C C C C
charge: 0.290712 -0.199349 -0.284904 -0.078408 -0.099189 -0.081442 -0.182881 -0.045883 -0.108163 -0.050701 0.066223 0.108534 0.198880 0.033597 0.221589 0.087289 0.205459 0.060119 0.080043 -0.340086 -0.042171 -0.185544 0.314682 0.171465 -0.073155 -0.102538 -0.002841 0.038664
polarizability: 3.92997255e+02 1.18121668e+00 2.15761482e+02 -1.36871232e+01 -1.78897333e+01 1.88909224e+02
1716.lowfreq: -11.2104 -6.4738 -3.9350 -0.0008 0.0006 0.0012 2.3876 13.6834 22.1424
frequency: -8.9699 11.8870 22.1332 28.0923 34.7084 41.4234 69.2925 69.9850 84.9382 96.9751 121.2897 124.7711 137.1108 166.0229 177.2212 197.8429 216.7849 250.2467 252.4119 273.8751 288.0986 294.8698 302.3348 317.1547 327.0827 358.1845 370.9389 407.5435 413.6702 422.0348 430.4354 454.5641 457.8756 501.1440 503.1966 510.2510 516.0961 527.6643 536.1711 561.7619 576.7688 587.2701 590.7878 628.0398 647.0550 657.8318 681.6501 714.6948 726.3697 733.9499 754.6665 767.8464 779.3392 781.5375 805.3081 817.7618 824.9654 832.2870 863.4296 875.8812 881.9513 891.6061 922.3038 945.2354 958.6063 974.4739 982.9888 990.2032 1011.9178 1018.5394 1029.1238 1037.0872 1042.0535 1062.9539 1074.3275 1103.9573 1108.8732 1136.0532 1163.3525 1170.2229 1172.6477 1177.8505 1184.2815 1200.4791 1208.1204 1226.3637 1248.2131 1264.2483 1268.6737 1281.0635 1289.0168 1290.2791 1302.2494 1310.3573 1312.5014 1331.5802 1340.8754 1351.4616 1372.9735 1378.3884 1386.0158 1389.3893 1391.2756 1435.2046 1439.1860 1443.1539 1460.8330 1479.3997 1493.2422 1519.2390 1563.5705 1588.4691 1607.1002 1621.2407 2968.0369 3015.2685 3024.4038 3055.1294 3058.6805 3061.5783 3073.7598 3134.6481 3142.4459 3147.4389 3165.3585 3180.4620 3229.7444 3409.7301 3549.1371 3568.1333 3588.9953 3725.5480
redmass: 6.4729 6.8931 6.9155 6.2612 6.5291 6.9258 6.4659 6.8401 6.9587 3.6381 6.1990 7.9574 6.8752 6.3931 3.7590 7.1841 7.8876 2.5808 6.0288 3.2788 4.9730 4.6962 1.8592 5.3169 3.6702 4.5600 3.2167 5.4594 5.0971 5.6402 1.2219 1.2816 3.9390 1.2235 3.4829 4.0358 5.1359 4.6071 4.1448 5.2322 6.2861 1.2232 7.8737 5.8654 4.6390 5.3277 4.7162 11.6927 6.1807 4.7425 2.9924 1.4651 8.0385 5.2344 3.0113 1.7892 7.4048 4.3965 1.4751 3.6672 8.9142 1.6572 4.0558 1.3872 5.3852 4.4655 1.3224 3.3084 3.3726 2.4924 2.0676 2.4889 2.7547 4.0569 1.9357 2.1652 5.1726 1.1555 1.2235 1.1036 2.1611 2.0714 1.5488 2.1562 1.2977 2.2114 1.4016 1.2540 1.4366 1.4688 1.4134 2.4076 1.3635 4.3726 1.3636 4.2770 1.2613 1.5348 2.3387 1.3343 8.4096 1.8004 1.7727 1.4934 4.4221 1.5434 1.0894 2.7639 3.2483 9.4296 9.5031 6.5468 1.4762 7.5522 1.0659 1.0870 1.0846 1.0864 1.0875 1.0586 1.0981 1.0874 1.1073 1.0903 1.0954 1.0993 1.0985 1.0645 1.0656 1.0443 1.0668 1.1057
irintensity: 0.6737 1.1869 0.3886 0.0558 0.7585 0.1789 4.1874 4.3516 4.3914 5.0811 0.5761 0.9165 0.3487 5.7508 1.2473 0.7944 1.3187 27.3570 3.1403 4.5212 5.1130 18.5566 13.6566 9.7427 10.0605 8.8938 11.1738 5.2951 21.6201 5.9741 187.3795 180.6675 5.3734 14.7086 11.4021 2.9051 7.6573 0.6478 35.5372 1.0792 11.9736 128.8466 0.2608 16.4564 19.0542 7.4987 25.9434 3.2306 78.3155 5.6057 25.8466 70.8209 39.8053 21.5892 24.9529 8.5263 35.0937 22.0808 0.7058 41.7228 135.1993 4.5121 114.0714 2.5244 1.4391 118.3562 0.0472 151.3158 71.2576 31.6895 8.5317 12.5188 42.2401 10.7440 17.6306 20.4262 84.5119 11.6000 15.1141 1.3619 18.0632 49.1298 78.1998 62.3271 8.2239 12.6453 18.9717 9.0179 1.6286 5.4208 20.9294 14.3315 21.9643 56.0724 25.0051 31.0995 62.3762 16.2782 205.7030 14.3870 0.0435 6.5491 40.0031 21.5058 43.6839 14.5441 1.5830 43.9008 187.1382 435.6496 187.6077 12.4166 394.2626 5.4550 38.9867 52.3830 21.4944 12.1873 9.4129 5.0048 35.4585 3.5769 0.6647 10.0797 16.8964 10.5153 0.2448 62.2466 9.1916 104.0522 20.5391 42.0310
temp: 298.150 k
press: 1.00000 atm
elementType: 16 9 8 8 8 8 7 7 7 7 7 6 6 6 6 6 6 6 6 6 6 6 6 6 6 6 6 6 1 1 1 1 1 1 1 1 1 1 1 1 1 1 1 1 1 1
symmnumber: 1
zpe: 899943.5 jmol-1
zpe.correction: 0.342770 hartree
zpe.thermalcorrener: 0.367936 hartree
zpe.thermalcorrenthalpy: 0.368880 hartree
zpe.thermalcorrgfe: 0.284915 hartree
zpe.sumelectzpe: -1729.102636 hartree
zpe.sumelectthermal: -1729.077470 hartree
zpe.sumelectthermalent: -1729.076526 hartree
zpe.sumelectthermalfe: -1729.160491 hartree
dipole: -1.3041 4.2096 -3.1098
dipole: 5.3937
quadrupole: -156.3322 -167.0664 -168.6880
quadrupole: -1.9676 -27.7838 -13.3473
quadrupole: 7.6966 -3.0375 -4.6591 -1.9676 -27.7838 -13.3473
hfenergy: -1729.445406 hartree
pointgroup: C01 [X(C17H18F1N5O4S1)]
dipole: -0.5976527 -1.6106526 -1.2456854 debye
polarizability: 391.2722176|-22.6183306|202.3579606|2.8931788|22.2494599|204.0377832 unknown
InChI: InChI=1S/C17H18FN5O4S/c18-9-4-2-1-3-8(9)6-28-15-11-14(21-17(19)22-15)23(7-20-11)16-13(26)12(25)10(5-24)27-16/h1-4,7,10,12-13,16,24-26H,5-6,19H2
charge 0 multiplicity 1
46 atoms
S  -2.572434 0.800485 0.768887
F  -5.486823 -1.740083 0.892671
O  4.442586 1.189553 0.226773
O  5.570852 -1.082636 2.160686
O  6.017642 -2.020916 -0.282009
O  5.106814 1.953126 -2.449207
N  2.423354 0.621336 1.421093
N  0.397014 1.477252 2.104012
N  1.64084 -0.788665 -0.473312
N  -0.804478 -0.65981 -0.758098
N  0.516606 -1.971468 -2.1679
C  4.395498 -0.984924 1.30343
C  3.881722 0.473504 1.385906
C  4.814696 -1.172838 -0.189655
C  5.184917 0.246831 -0.662798
C  4.77204 0.572252 -2.100807
C  1.461374 0.074138 0.563232
C  1.717261 1.462583 2.314947
C  0.21302 0.612885 1.006708
C  -0.937219 0.194565 0.287733
C  0.457452 -1.110562 -1.094207
C  -3.641126 -0.08798 -0.555253
C  -5.08187 0.299719 -0.356427
C  -5.976429 -0.526685 0.360305
C  -5.615181 1.506728 -0.880474
C  -7.330276 -0.216966 0.566583
C  -6.970553 1.853782 -0.691509
C  -7.828888 0.992363 0.032698
H  3.625113 -1.711089 1.623388
H  4.273581 0.935436 2.308697
H  3.966689 -1.583328 -0.76387
H  6.268318 0.422354 -0.521591
H  3.684813 0.378263 -2.21815
H  5.341394 -0.057208 -2.80645
H  6.264463 -1.569537 1.62923
H  5.758688 -2.958463 -0.462055
H  2.235497 2.026582 3.088209
H  4.689623 2.539138 -1.765859
H  -3.466906 -1.164847 -0.426723
H  -3.248457 0.231241 -1.531898
H  1.414254 -2.323041 -2.486292
H  -0.346008 -2.220748 -2.643066
H  -4.948933 2.17642 -1.436183
H  -7.965353 -0.906384 1.130257
H  -7.356359 2.791013 -1.105201
H  -8.880623 1.257229 0.182546
