program: Gaussian 09
title: 000243933
version: EM64L-G09RevD.01
frameworkgroup: C1[X(C9H8ClNO3)]
method: RPBEPBE
basis: SDD
operation: Freq
keyword: #p
keyword: freq=noraman
keyword: PBEPBE/SDD
title: #p freq=noraman PBEPBE/SDD
converged: YES YES NO NO
title: Mulliken charges:
elementType: Cl O O O N C C C C C C C C C H H H H H H H H
charge: -0.034198 -0.219441 -0.455389 -0.174255 -0.349549 0.559009 -0.487900 -0.321011 -0.394297 -0.216402 -0.229353 -0.224799 0.183051 0.118647 0.277709 0.240366 0.239842 0.357582 0.259270 0.236424 0.239284 0.395411
chargesum: 0.00000
title: Mulliken charges with hydrogens summed into heavy atoms:
elementType: Cl O O O N C C C C C C C C C
charge: -0.034198 -0.219441 -0.059977 -0.174255 0.008032 0.559009 0.030174 -0.321011 -0.154454 0.042867 0.007071 0.014485 0.183051 0.118647
polarizability: 1.61197201e+02 2.49152009e+01 1.12391095e+02 1.53699164e+01 -2.70707784e+00 8.69634852e+01
1716.lowfreq: -12.9896 -4.3797 0.0018 0.0020 0.0029 5.6935 24.9249 29.0965 50.5630
frequency: 24.9067 28.9367 50.5432 57.3538 132.5920 163.4441 192.6500 234.4666 248.8885 317.4922 353.0279 398.0472 423.9991 444.6753 448.8245 488.5797 540.1624 584.4240 617.0113 630.4449 655.7418 666.8805 728.6591 761.0665 765.5790 790.4273 860.4251 875.8772 947.9598 969.3203 988.7846 1019.9493 1022.5631 1039.5377 1052.5609 1128.8691 1173.0314 1174.9085 1214.4283 1221.7721 1277.6036 1288.4286 1348.3348 1378.1386 1427.7579 1462.3969 1474.3457 1482.7075 1578.3570 1605.4743 1632.7352 1686.1399 2987.0195 3055.0086 3126.7128 3144.2433 3161.8482 3176.3903 3525.5640 3533.9329
redmass: 9.6679 9.0142 6.1976 12.7871 4.9398 7.1739 6.4762 4.4319 4.8180 6.8639 4.2477 7.6480 4.0146 3.4016 4.2273 4.4685 5.0613 3.6403 1.5300 4.4594 1.4910 2.7607 4.1688 1.2480 11.1587 5.0199 2.1991 1.8719 1.4140 2.2232 1.3397 3.0626 7.3907 2.3236 4.3107 1.5945 1.3962 1.3855 2.0728 1.2631 1.3382 2.0863 1.4965 6.4214 2.1568 2.0981 1.4178 1.4507 6.1437 7.1761 9.9112 10.2989 1.0635 1.0979 1.0883 1.0889 1.0946 1.0998 1.0652 1.0779
irintensity: 5.5177 0.8530 0.7308 1.9334 0.7724 1.2918 1.9049 5.9550 1.0983 5.9096 4.1529 7.8643 3.1548 4.0085 20.0546 0.8355 9.1356 8.5165 205.5709 25.4217 45.5612 65.7608 2.2129 87.0008 1.7152 5.9359 9.7212 6.9325 5.4078 16.0690 0.0645 202.5059 36.2855 32.5938 6.1520 0.2719 19.2319 9.4904 7.4060 18.0842 9.7849 9.9824 2.8147 1.2984 27.6860 59.2169 79.7711 133.1617 7.6003 0.5107 225.0096 214.4054 30.0028 8.2041 5.9386 7.4489 13.9006 12.1258 35.5149 37.7680
temp: 298.150 k
press: 1.00000 atm
elementType: 17 8 8 8 7 6 6 6 6 6 6 6 6 6 1 1 1 1 1 1 1 1
symmnumber: 1
zpe: 411467.2 jmol-1
zpe.correction: 0.156720 hartree
zpe.thermalcorrener: 0.169781 hartree
zpe.thermalcorrenthalpy: 0.170725 hartree
zpe.thermalcorrgfe: 0.114421 hartree
zpe.sumelectzpe: -1087.237542 hartree
zpe.sumelectthermal: -1087.224480 hartree
zpe.sumelectthermalent: -1087.223536 hartree
zpe.sumelectthermalfe: -1087.279840 hartree
dipole: -4.8312 -4.0967 -3.2969
dipole: 7.1410
quadrupole: -91.5783 -83.2013 -85.2881
quadrupole: -6.0942 -8.7373 -2.5355
quadrupole: -4.8891 3.4879 1.4011 -6.0942 -8.7373 -2.5355
hfenergy: -1087.3942612 hartree
pointgroup: C01 [X(C9H8Cl1N1O3)]
dipole: -1.6756813 2.1832359 0.5645281 debye
dipolederiv: -0.2864454 0.2758663 -0.0791035 0.2689883 -0.4681947 0.1618435 -0.0761351 0.1692239 -0.1419684 -0.6214261 0.0408823 -0.0376864 0.3880253 -0.6896048 -0.2047007 0.1948005 -0.2897263 -0.5072028 -0.4602907 0.0929239 0.085487 0.0467068 -0.9780472 -0.3229312 0.0489616 -0.3454342 -0.5973061 -0.9044709 0.3134168 -0.0249078 0.0726363 -0.5182914 -0.1250709 -0.2568274 -0.0059957 -0.3867632 -1.1649956 0.3099425 0.1346531 0.2049238 -0.5113901 -0.0449669 0.051742 0.0215892 -0.4476558 0.0586305 0.0482968 -0.1131687 -0.0063931 -0.1540429 0.093192 -0.1069715 0.0943638 -0.1037328 0.5387255 0.0240574 -0.0017042 0.2867682 0.1188973 -0.074586 0.1040225 -0.0799457 0.3536558 0.3023356 -0.483652 0.1318551 -0.4072776 0.6370238 -0.3076513 0.1023509 -0.2785121 0.0940093 -0.0764362 -0.0537388 -0.0376017 -0.0420916 -0.0196423 -0.0962731 -0.0587857 -0.084061 -0.0124684 -0.163691 0.1289408 -0.0609801 0.1068672 -0.1706787 -0.0158356 -0.0343223 -0.0346239 -0.0334064 -0.0590711 -0.1019819 0.020572 -0.1030456 -0.0071085 -0.058294 0.0353611 -0.0621734 -0.1049246 0.0218199 -0.0516444 -0.1044678 -0.0636655 -0.0282034 -0.0550499 -0.0757673 -0.0742029 -0.0180746 1.0318792 -0.3812511 -0.0312453 -0.69554 0.8735708 0.3385538 -0.119886 0.2992663 0.4761723 1.1475922 -0.4333492 0.0718514 -0.2117308 1.0896174 0.4309075 0.248947 0.3793709 0.5983094 0.0693191 0.0381205 0.0375471 -0.0709436 0.0151803 -0.0425939 -0.029065 0.0112958 0.1049691 -0.0488043 0.0285613 -0.0376864 -0.0255951 0.0241827 0.1443064 -0.0628855 0.0802024 -0.0679356 0.0901288 -0.0187109 0.0760371 -0.0125616 0.049975 0.0946233 0.0591227 0.1109597 -0.0014675 0.2894121 0.0579612 -0.0271175 0.0561541 0.2222251 -0.0595484 -0.0608368 -0.0335873 0.2674159 0.0980866 0.0053238 0.0405779 -0.0104071 0.0679595 0.0928589 0.0552724 0.0839135 0.045091 0.029429 0.1083558 -0.0061829 0.1231774 0.0007567 0.0664742 -0.0058657 0.0705479 0.1034165 -0.041358 0.0576517 0.0982783 0.0562408 0.1012 0.0146811 0.1052143 0.013381 0.0711502 0.1496305 -0.0059729 -0.1350069 0.0387633 0.3446154 -0.0299385 -0.118447 -0.045852 0.3087166 unknown
polarizability: 154.549077|-34.2402233|112.342509|-6.5898388|-9.9367216|93.6601951 unknown
InChI: InChI=1S/C9H8ClNO3/c10-7-4-2-1-3-6(7)5-11-8(12)9(13)14/h1-4,11,13H,5H2
charge 0 multiplicity 1
22 atoms
Cl -0.692252 -2.079876 0.995438
O  2.459555 -1.577812 -1.282047
O  3.061514 1.132623 1.026448
O  4.519648 -0.623067 0.546595
N  1.179608 0.245954 -0.555421
C  -1.301187 0.157214 -0.592763
C  -0.011548 -0.087249 -1.3590
C  -1.717746 -0.656505 0.489701
C  -2.151705 1.234276 -0.954762
C  -2.914001 -0.424129 1.194731
C  -3.35756 1.48916 -0.265703
C  -3.738017 0.659314 0.812814
C  2.30746 -0.543923 -0.575741
C  3.428853 -0.061197 0.369067
H  0.099036 -1.147144 -1.651743
H  -0.01753 0.51465 -2.288605
H  -1.85641 1.875336 -1.7942
H  1.16893 1.066789 0.05578
H  -3.198082 -1.081553 2.02147
H  -3.995163 2.32588 -0.568825
H  -4.67097 0.844698 1.355242
H  3.791269 1.426161 1.635124
