program: Gaussian 09
title: 000243950
version: EM64L-G09RevD.01
frameworkgroup: C1[X(C17H18BrN5O4S)]
method: RPBEPBE
basis: SDD
operation: Freq
keyword: #p
keyword: freq=noraman
keyword: PBEPBE/SDD
title: #p freq=noraman PBEPBE/SDD
converged: YES YES NO NO
title: Mulliken charges:
elementType: Br S O O O O N N N N N C C C C C C C C C C C C C C C C C H H H H H H H H H H H H H H H H H H
charge: 0.010965 0.286324 -0.279439 -0.451514 -0.435237 -0.425835 -0.228648 -0.037573 -0.090961 -0.053479 -0.586880 -0.182306 -0.103452 -0.129740 -0.128114 -0.376609 0.174124 -0.242392 0.095419 -0.350494 -0.048267 -0.806181 0.484821 -0.362510 -0.371408 -0.180977 -0.180016 -0.206865 0.296787 0.283544 0.303972 0.255582 0.213900 0.269015 0.358979 0.351470 0.299410 0.339298 0.288567 0.288776 0.333247 0.327513 0.246333 0.245370 0.252640 0.252839
chargesum: 0.00000
title: Mulliken charges with hydrogens summed into heavy atoms:
elementType: Br S O O O O N N N N N C C C C C C C C C C C C C C C C C
charge: 0.010965 0.286324 -0.279439 -0.092535 -0.083767 -0.086537 -0.228648 -0.037573 -0.090961 -0.053479 0.073880 0.114480 0.180092 0.174232 0.127468 0.106306 0.174124 0.057019 0.095419 -0.350494 -0.048267 -0.228838 0.484821 -0.116177 -0.126039 0.071663 0.072823 -0.206865
polarizability: 4.62853132e+02 -1.42140489e+01 2.34752924e+02 6.52480317e+00 5.93245087e+00 1.73975899e+02
1716.lowfreq: -11.2344 -6.4443 -5.0003 0.0005 0.0009 0.0013 3.7481 11.5530 12.4987
frequency: -9.8063 11.0399 12.3076 22.0197 24.5258 34.5291 59.4360 75.9476 91.3364 102.3257 107.0450 109.1488 131.7165 161.3956 175.7012 187.4671 199.3119 202.9232 231.5416 251.8257 278.5169 279.9114 289.1055 300.1295 310.8683 320.4183 324.9399 344.0614 346.8537 361.4413 376.7317 404.4505 414.6092 424.4182 445.9983 454.1119 493.1551 509.0500 511.6109 527.3919 591.7449 602.9042 615.1280 624.6881 629.2020 634.0240 656.4816 707.7027 715.0124 727.6266 746.4220 764.0135 781.6689 801.0256 810.8760 824.4441 830.0535 832.2168 843.6631 879.2812 886.2580 888.6237 915.2755 953.5366 956.2857 960.1817 970.5897 976.9363 996.1487 997.3727 1010.6110 1022.6662 1041.1402 1052.5516 1059.5444 1080.3521 1092.6627 1096.2293 1131.0490 1143.9853 1150.6724 1169.4149 1182.4446 1187.8021 1217.6285 1221.4735 1236.5701 1243.6576 1254.5495 1273.0623 1278.6505 1294.0285 1296.1335 1305.4125 1313.3951 1323.2327 1336.6846 1349.1329 1360.8744 1373.2155 1373.4475 1377.0588 1391.7211 1393.1427 1424.4557 1444.7785 1472.8764 1476.4130 1492.6160 1517.3956 1561.6241 1580.3033 1597.4990 1609.0966 2993.7758 3021.6610 3031.4499 3052.1051 3056.0966 3112.5509 3116.5494 3126.9589 3135.9888 3137.9942 3170.0309 3173.2944 3257.7694 3531.3140 3559.0346 3566.9661 3570.2228 3724.7380
redmass: 8.2128 5.2270 5.5033 7.3555 6.7542 7.0125 7.4777 8.5682 7.4372 8.2737 4.4141 6.6231 7.1868 6.1394 5.6258 7.7526 4.0831 4.2562 4.9057 6.0230 2.4262 4.6761 1.4230 5.1073 1.4680 5.3929 1.6120 2.4977 3.6150 2.4613 5.4182 2.8604 7.6924 6.6761 5.9195 1.2051 3.5837 5.4864 1.0944 4.6209 8.0892 5.8844 6.1774 6.8393 6.5258 6.3259 5.4263 6.8764 11.3951 3.3033 5.0335 7.4973 6.3453 4.1443 7.7468 1.4954 2.4376 1.2484 1.7442 3.9241 7.3699 1.5304 3.0247 3.1581 1.5740 3.4592 1.3773 3.9176 5.0014 3.2896 4.0089 3.6580 2.9365 1.8532 2.5980 1.6332 1.2763 5.5771 1.1104 1.4116 1.2464 1.8649 2.5095 1.1136 1.9678 1.7282 1.5240 1.5571 1.3318 1.9975 2.0498 1.4245 1.2669 3.0384 1.7213 1.6052 3.2920 1.3129 1.2667 6.3310 7.1403 1.2305 2.7779 1.4131 4.4003 1.1140 2.4610 1.0753 3.3105 9.9239 10.6423 7.3200 6.1873 1.4985 1.0670 1.0865 1.0873 1.0580 1.0876 1.0974 1.0897 1.1080 1.0903 1.0899 1.0953 1.0964 1.0981 1.0665 1.0664 1.0446 1.0662 1.1058
irintensity: 0.0518 0.0506 0.2632 0.0882 0.1372 1.5489 1.7916 1.2185 1.7248 0.1669 5.9505 4.3284 3.1611 2.2165 4.5230 0.5744 1.8940 1.6666 3.8266 7.9482 6.0441 3.8306 83.5419 14.3902 194.6413 51.2627 89.0618 0.5409 26.6036 22.3600 5.1712 0.0246 2.4022 14.7145 12.7823 301.5034 23.8130 3.2711 0.9519 22.1355 0.4846 0.8685 3.5566 0.2699 11.9707 7.4056 14.5578 11.8151 5.6537 13.0449 38.4357 35.6972 18.2857 30.4054 10.3752 16.2501 36.8202 0.0338 54.5316 37.5185 141.7991 0.6923 30.3750 6.9811 12.5618 37.0588 0.0159 144.6631 76.7181 55.5611 76.1536 114.1155 83.7400 14.4163 39.3291 5.2165 4.9853 117.7436 3.5730 11.2137 8.9388 93.8693 143.2475 0.4585 3.3223 23.3753 22.5390 21.8093 12.9472 2.5296 2.1226 25.1754 0.0028 68.8645 46.2826 12.8243 35.5775 7.6244 41.1433 99.7301 11.9224 3.2697 8.0783 10.9044 46.6601 12.3475 97.9150 11.3921 167.3860 412.6771 238.1951 0.2952 18.2199 426.4123 48.2225 29.0493 13.8277 6.3034 10.7135 4.6702 3.4535 1.8449 6.8899 11.8345 8.4016 0.4965 5.3464 23.4020 9.7415 114.1465 19.0989 44.9927
temp: 298.150 k
press: 1.00000 atm
elementType: 35 16 8 8 8 8 7 7 7 7 7 6 6 6 6 6 6 6 6 6 6 6 6 6 6 6 6 6 1 1 1 1 1 1 1 1 1 1 1 1 1 1 1 1 1 1
symmnumber: 1
zpe: 892285.4 jmol-1
zpe.correction: 0.339854 hartree
zpe.thermalcorrener: 0.366111 hartree
zpe.thermalcorrenthalpy: 0.367055 hartree
zpe.thermalcorrgfe: 0.278942 hartree
zpe.sumelectzpe: -1642.714006 hartree
zpe.sumelectthermal: -1642.687749 hartree
zpe.sumelectthermalent: -1642.686805 hartree
zpe.sumelectthermalfe: -1642.774918 hartree
dipole: -1.3046 4.3681 -0.9802
dipole: 4.6629
quadrupole: -207.3207 -157.3329 -181.4033
quadrupole: 7.7638 12.8015 0.2453
quadrupole: -25.3018 24.6861 0.6157 7.7638 12.8015 0.2453
hfenergy: -1643.0538599 hartree
pointgroup: C01 [X(C17H18Br1N5O4S1)]
dipole: 0.435597 -1.6246325 -0.732346 debye
polarizability: 460.8752917|-20.0827003|235.7864291|-18.1443889|7.2716153|174.920234 unknown
InChI: InChI=1S/C17H18BrN5O4S/c18-9-3-1-8(2-4-9)6-28-15-11-14(21-17(19)22-15)23(7-20-11)16-13(26)12(25)10(5-24)27-16/h1-4,7,10,12-13,16,24-26H,5-6,19H2
charge 0 multiplicity 1
46 atoms
Br -9.606002 1.500135 0.530812
S  -2.517067 0.736393 -0.204312
O  4.698581 1.426311 -1.162902
O  5.544822 -1.508965 -0.347282
O  4.233366 1.003857 2.025914
O  8.046314 1.54795 0.578043
N  2.490864 0.598109 -0.785275
N  0.599316 1.887131 -0.568651
N  1.472892 -1.654642 -0.701143
N  -0.975786 -1.538008 -0.425172
N  0.138953 -3.586873 -0.595194
C  4.493352 -0.612667 0.135937
C  3.902497 0.214029 -1.046678
C  5.161367 0.469997 1.02341
C  5.63629 1.53205 0.011074
C  7.075231 1.314419 -0.499184
C  1.424437 -0.295767 -0.674873
C  1.931876 1.898278 -0.731789
C  0.259397 0.520739 -0.532862
C  -0.968448 -0.181004 -0.4006
C  0.223253 -2.213438 -0.574171
C  -3.752241 -0.732114 -0.125186
C  -5.150454 -0.189539 0.031403
C  -5.927767 0.151295 -1.10537
C  -5.717891 -0.011234 1.319028
C  -7.241863 0.650748 -0.96895
C  -7.030539 0.486331 1.47678
C  -7.777538 0.81044 0.325767
H  3.709831 -1.161347 0.686427
H  3.949731 -0.339843 -2.001644
H  6.001211 0.057263 1.599448
H  5.517178 2.549593 0.429542
H  7.255269 1.972345 -1.37273
H  7.215899 0.264428 -0.796732
H  5.127356 -2.314314 -0.744149
H  3.4243 1.369904 1.58209
H  2.552455 2.782537 -0.844958
H  8.056615 2.510919 0.811004
H  -3.435013 -1.357797 0.722194
H  -3.611853 -1.300511 -1.056826
H  -0.771901 -4.026278 -0.499718
H  0.984518 -4.139199 -0.702966
H  -5.504182 0.029197 -2.108877
H  -5.130959 -0.261218 2.2103
H  -7.833484 0.908649 -1.851805
H  -7.459483 0.617213 2.474131
