program: Gaussian 09
title: 000243931
version: EM64L-G09RevD.01
frameworkgroup: C1[X(C11H10FN5)]
method: RPBEPBE
basis: SDD
operation: Freq
keyword: #p
keyword: freq=noraman
keyword: PBEPBE/SDD
title: #p freq=noraman PBEPBE/SDD
converged: YES YES NO NO
title: Mulliken charges:
elementType: F N N N N N C C C C C C C C C C C H H H H H H H H H H
charge: -0.202491 -0.125429 -0.129784 -0.117181 -0.583721 -0.582813 0.511064 -0.294547 -0.347849 -0.372859 -0.322454 0.126809 -0.378065 -0.379556 0.319617 0.021026 0.015845 0.271979 0.238752 0.240420 0.248428 0.256129 0.256835 0.334515 0.331834 0.331363 0.332134
chargesum: 0.00000
title: Mulliken charges with hydrogens summed into heavy atoms:
elementType: F N N N N N C C C C C C C C C C C
charge: -0.202491 -0.125429 -0.129784 -0.117181 0.082629 0.080684 0.511064 -0.022568 -0.109097 -0.132439 -0.074026 0.126809 -0.121936 -0.122722 0.319617 0.021026 0.015845
polarizability: 3.28550960e+02 -1.16524442e+01 1.71964467e+02 5.76413633e-03 -3.68214898e-02 6.18245650e+01
1716.lowfreq: -1.6263 -0.0007 0.0003 0.0006 1.3973 4.4488 28.9443 42.1966 54.8034
frequency: 28.9022 42.1835 54.7759 92.2360 159.7374 173.7270 185.8433 210.5889 229.6027 246.3686 319.8335 359.4652 373.7666 414.4785 421.4914 474.9472 489.9062 490.5762 509.4918 522.8613 545.4475 549.9224 556.1622 589.2672 630.0889 675.4586 698.6770 714.8858 729.2537 774.0149 802.7978 814.2833 836.0152 848.5659 899.9221 901.3296 927.1509 947.5846 959.4848 988.9447 1003.0920 1012.0928 1097.1788 1106.5028 1127.6827 1156.5545 1197.6436 1218.1155 1236.2923 1282.0105 1288.5018 1311.2467 1367.0626 1393.2517 1408.3792 1415.7620 1472.8943 1495.7815 1509.2180 1516.7300 1589.5697 1596.3287 1609.1275 1622.0617 1653.0075 3111.7883 3138.7194 3145.7573 3152.4829 3175.2689 3178.2866 3554.8338 3557.0921 3715.5332 3717.1520
redmass: 3.9511 7.7547 6.1705 6.0598 6.9537 5.2246 6.0586 4.8656 6.2082 3.5111 2.8720 5.6795 4.5675 2.9632 3.6144 1.2003 8.8315 1.2353 2.4876 3.5376 1.0502 1.0408 7.7047 7.2089 7.0817 4.8033 5.9710 11.6527 3.9628 5.4678 6.2446 1.2797 1.7185 4.6544 12.6952 2.0046 2.3275 1.3726 1.3661 3.2990 2.7453 1.1580 2.2952 1.4947 2.5117 1.4756 1.6284 2.0581 4.2027 2.1814 1.5280 1.3562 5.2236 6.4530 4.5972 3.5347 6.1114 2.7095 2.2738 3.8577 7.1261 1.4435 6.2424 2.0613 5.5120 1.0903 1.0901 1.0903 1.0884 1.0961 1.0966 1.0440 1.0443 1.1058 1.1058
irintensity: 0.0023 0.3016 0.0922 3.2098 1.2173 0.0288 10.6136 0.0015 3.1407 4.1866 5.9849 0.1159 1.2886 0.3698 5.7001 72.5237 42.1368 537.5489 1.4708 1.3977 7.3890 2.6053 4.7405 1.6108 0.0680 13.6939 0.0726 0.0038 6.8035 19.7097 7.6539 0.4051 105.0721 4.9341 1.8888 2.8212 10.2291 3.6706 0.0183 1.8092 7.6855 51.3052 2.7239 11.9889 0.4632 93.0497 6.7484 81.2074 40.8122 13.0558 2.6230 16.0968 24.1885 132.9608 45.8698 25.8211 762.5904 387.9063 97.5143 491.3183 17.2409 626.3264 59.8437 378.2742 17.8756 0.9239 6.6447 16.4468 4.4896 5.6915 6.5385 145.2799 89.1335 44.1714 48.6808
temp: 298.150 k
press: 1.00000 atm
elementType: 9 7 7 7 7 7 6 6 6 6 6 6 6 6 6 6 6 1 1 1 1 1 1 1 1 1 1
symmnumber: 1
zpe: 528289.1 jmol-1
zpe.correction: 0.201215 hartree
zpe.thermalcorrener: 0.215804 hartree
zpe.thermalcorrenthalpy: 0.216748 hartree
zpe.thermalcorrgfe: 0.158390 hartree
zpe.sumelectzpe: -797.602636 hartree
zpe.sumelectthermal: -797.588046 hartree
zpe.sumelectthermalent: -797.587102 hartree
zpe.sumelectthermalfe: -797.645460 hartree
dipole: 3.1538 0.7464 0.0024
dipole: 3.2409
quadrupole: -92.3461 -75.2573 -103.6413
quadrupole: -1.9948 0.0269 -0.0382
quadrupole: -1.9312 15.1576 -13.2265 -1.9948 0.0269 -0.0382
hfenergy: -797.8038505 hartree
pointgroup: C01 [X(C11H10F1N5)]
dipole: -1.240774 0.2935018 0.0113989 debye
polarizability: 328.5509343|11.6568504|171.8395841|-0.1493788|3.6908077|61.9494729 unknown
InChI: InChI=1S/C11H10FN5/c12-8-4-1-7(2-5-8)3-6-9-15-10(13)17-11(14)16-9/h1-6H,13-14H2
charge 0 multiplicity 1
27 atoms
F  6.277896 -0.2393 -0.026169
N  -2.63408 -1.353082 -0.04117
N  -2.188787 1.040021 0.036015
N  -4.498955 0.233435 0.012585
N  -4.85945 -2.080655 -0.061593
N  -4.003681 2.520364 0.085062
C  2.073833 0.178761 -0.000316
C  0.619532 0.384161 0.009753
C  2.682284 -1.111379 -0.048452
C  2.925379 1.321557 0.039045
C  -0.3509 -0.580534 -0.019688
C  -1.786261 -0.273092 -0.006797
C  4.081559 -1.257616 -0.057209
C  4.329546 1.197512 0.031205
C  4.876361 -0.095735 -0.017228
C  -3.976527 -1.032847 -0.028983
C  -3.550312 1.226817 0.0437
H  0.267431 1.424413 0.044554
H  2.056823 -2.009011 -0.079441
H  2.475222 2.320128 0.076529
H  -0.124355 -1.65163 -0.055223
H  4.557354 -2.241829 -0.094216
H  4.986505 2.071251 0.06144
H  -4.494111 -3.028828 -0.094217
H  -5.858385 -1.892186 -0.055461
H  -3.327734 3.279004 0.109819
H  -5.004885 2.695898 0.093357
